Package Details: telepathy-hanging-git r12.ab43734-1

Git Clone URL: https://aur.archlinux.org/telepathy-hanging-git.git (read-only)
Package Base: telepathy-hanging-git
Description: Telepathy Connection Manager for Google Talk
Upstream URL: https://github.com/tiagosh/telepathy-hanging/
Licenses: GPL
Submitter: davidedmundson
Maintainer: davidedmundson
Last Packager: davidedmundson
Votes: 0
Popularity: 0.000000
First Submitted: 2015-07-24 10:08
Last Updated: 2015-07-24 11:27

Dependencies (4)

Required by (0)

Sources (1)

Latest Comments

isfeldt34 commented on 2015-11-24 12:14

Installed libhangish package, but this still won't build.
==> Starting package_telepathy-hanging-git()...
Scanning dependencies of target telepathy-hanging_automoc
[ 14%] Automatic moc for target telepathy-hanging
Generating moc_connection.cpp
Generating moc_hangingtextchannel.cpp
Generating moc_protocol.cpp
[ 14%] Built target telepathy-hanging_automoc
Scanning dependencies of target telepathy-hanging
[ 28%] Building CXX object CMakeFiles/telepathy-hanging.dir/main.cpp.o
[ 42%] Building CXX object CMakeFiles/telepathy-hanging.dir/connection.cpp.o
[ 57%] Building CXX object CMakeFiles/telepathy-hanging.dir/protocol.cpp.o
[ 71%] Building CXX object CMakeFiles/telepathy-hanging.dir/hangingtextchannel.cpp.o
/tmp/yaourt-tmp-ubuntu/aur-telepathy-hanging-git/src/telepathy-hanging/hangingtextchannel.cpp: In constructor ‘HangingTextChannel::HangingTextChannel(HangingConnection*, const QString&, QString, QStringList, QObject*)’:
/tmp/yaourt-tmp-ubuntu/aur-telepathy-hanging-git/src/telepathy-hanging/hangingtextchannel.cpp:68:61: error: no matching function for call to ‘Tp::BaseChannelGroupInterface::create()’
mGroupIface = Tp::BaseChannelGroupInterface::create();
^
In file included from /usr/include/telepathy-qt5/TelepathyQt/BaseChannel:8:0,
from /tmp/yaourt-tmp-ubuntu/aur-telepathy-hanging-git/src/telepathy-hanging/hangingtextchannel.h:26,
from /tmp/yaourt-tmp-ubuntu/aur-telepathy-hanging-git/src/telepathy-hanging/hangingtextchannel.cpp:20:
/usr/include/telepathy-qt5/TelepathyQt/base-channel.h:534:41: note: candidate: static Tp::BaseChannelGroupInterfacePtr Tp::BaseChannelGroupInterface::create(Tp::ChannelGroupFlags, uint)
static BaseChannelGroupInterfacePtr create(ChannelGroupFlags initialFlags,
^
/usr/include/telepathy-qt5/TelepathyQt/base-channel.h:534:41: note: candidate expects 2 arguments, 0 provided
/usr/include/telepathy-qt5/TelepathyQt/base-channel.h:538:57: note: candidate: template<class BaseChannelGroupInterfaceSubclass> static Tp::SharedPtr<T> Tp::BaseChannelGroupInterface::create(Tp::ChannelGroupFlags, uint)
static SharedPtr<BaseChannelGroupInterfaceSubclass> create(ChannelGroupFlag
^
/usr/include/telepathy-qt5/TelepathyQt/base-channel.h:538:57: note: template argument deduction/substitution failed:
/tmp/yaourt-tmp-ubuntu/aur-telepathy-hanging-git/src/telepathy-hanging/hangingtextchannel.cpp:68:61: note: candidate expects 2 arguments, 0 provided
mGroupIface = Tp::BaseChannelGroupInterface::create();
^
/tmp/yaourt-tmp-ubuntu/aur-telepathy-hanging-git/src/telepathy-hanging/hangingtextchannel.cpp:74:22: error: ‘class Tp::BaseChannelGroupInterface’ has no member named ‘setGroupFlags’
mGroupIface->setGroupFlags(groupFlags);
^
/tmp/yaourt-tmp-ubuntu/aur-telepathy-hanging-git/src/telepathy-hanging/hangingtextchannel.cpp:75:22: error: ‘class Tp::BaseChannelGroupInterface’ has no member named ‘setSelfHandle’
mGroupIface->setSelfHandle(conn->selfHandle());
^
/tmp/yaourt-tmp-ubuntu/aur-telepathy-hanging-git/src/telepathy-hanging/hangingtextchannel.cpp:80:22: error: ‘class Tp::BaseChannelGroupInterface’ has no member named ‘setMembers’
mGroupIface->setMembers(members, QVariantMap());
^
/tmp/yaourt-tmp-ubuntu/aur-telepathy-hanging-git/src/telepathy-hanging/hangingtextchannel.cpp: In member function ‘void HangingTextChannel::eventReceived(ClientEvent&, bool)’:
/tmp/yaourt-tmp-ubuntu/aur-telepathy-hanging-git/src/telepathy-hanging/hangingtextchannel.cpp:194:45: error: ‘class Tp::BaseChannelGroupInterface’ has no member named ‘members’
Tp::UIntList members = mGroupIface->members();
^
/tmp/yaourt-tmp-ubuntu/aur-telepathy-hanging-git/src/telepathy-hanging/hangingtextchannel.cpp:210:22: error: ‘class Tp::BaseChannelGroupInterface’ has no member named ‘setMembers’
mGroupIface->setMembers(members, details);
^
In file included from /usr/include/telepathy-qt5/TelepathyQt/Callbacks:8:0,
from /usr/include/telepathy-qt5/TelepathyQt/base-channel.h:32,
from /usr/include/telepathy-qt5/TelepathyQt/BaseChannel:8,
from /tmp/yaourt-tmp-ubuntu/aur-telepathy-hanging-git/src/telepathy-hanging/hangingtextchannel.h:26,
from /tmp/yaourt-tmp-ubuntu/aur-telepathy-hanging-git/src/telepathy-hanging/hangingtextchannel.cpp:20:
/usr/include/telepathy-qt5/TelepathyQt/callbacks.h: In instantiation of ‘static Tp::FunctorCaller3<Functor, R, Arg1, Arg2, Arg3>::ResultType Tp::FunctorCaller3<Functor, R, Arg1, Arg2, Arg3>::invoke(Tp::AbstractFunctorCaller*, Arg1, Arg2, Arg3) [with Functor = Tp::MemberFunctor4<void, HangingTextChannel, const Tp::UIntList&, const QString&, unsigned int, Tp::DBusError*>; R = void; Arg1 = const Tp::UIntList&; Arg2 = const QString&; Arg3 = Tp::DBusError*; Tp::FunctorCaller3<Functor, R, Arg1, Arg2, Arg3>::ResultType = void]’:
/usr/include/telepathy-qt5/TelepathyQt/callbacks.h:205:157: required from ‘Tp::FunctorCaller3<Functor, R, Arg1, Arg2, Arg3>::FunctorCaller3(const Functor&) [with Functor = Tp::MemberFunctor4<void, HangingTextChannel, const Tp::UIntList&, const QString&, unsigned int, Tp::DBusError*>; R = void; Arg1 = const Tp::UIntList&; Arg2 = const QString&; Arg3 = Tp::DBusError*]’
/usr/include/telepathy-qt5/TelepathyQt/callbacks.h:223:112: required from ‘Tp::Callback3<R, Arg1, Arg2, Arg3>::Callback3(const Functor&) [with Functor = Tp::MemberFunctor4<void, HangingTextChannel, const Tp::UIntList&, const QString&, unsigned int, Tp::DBusError*>; R = void; Arg1 = const Tp::UIntList&; Arg2 = const QString&; Arg3 = Tp::DBusError*]’
/tmp/yaourt-tmp-ubuntu/aur-telepathy-hanging-git/src/telepathy-hanging/hangingtextchannel.cpp:70:100: required from here
/usr/include/telepathy-qt5/TelepathyQt/callbacks.h:211:43: error: no match for call to ‘(Tp::MemberFunctor4<void, HangingTextChannel, const Tp::UIntList&, const QString&, unsigned int, Tp::DBusError*>) (const Tp::UIntList&, const QString&, Tp::DBusError*&)’
return (typed->functor)(a1, a2, a3);
^
In file included from /usr/include/telepathy-qt5/TelepathyQt/Functors:8:0,
from /usr/include/telepathy-qt5/TelepathyQt/callbacks.h:30,
from /usr/include/telepathy-qt5/TelepathyQt/Callbacks:8,
from /usr/include/telepathy-qt5/TelepathyQt/base-channel.h:32,
from /usr/include/telepathy-qt5/TelepathyQt/BaseChannel:8,
from /tmp/yaourt-tmp-ubuntu/aur-telepathy-hanging-git/src/telepathy-hanging/hangingtextchannel.h:26,
from /tmp/yaourt-tmp-ubuntu/aur-telepathy-hanging-git/src/telepathy-hanging/hangingtextchannel.cpp:20:
/usr/include/telepathy-qt5/TelepathyQt/functors.h:168:16: note: candidate: Tp::MemberFunctor4<R, T, Arg1, Arg2, Arg3, Arg4>::ResultType Tp::MemberFunctor4<R, T, Arg1, Arg2, Arg3, Arg4>::operator()(Arg1, Arg2, Arg3, Arg4) const [with R = void; T = HangingTextChannel; Arg1 = const Tp::UIntList&; Arg2 = const QString&; Arg3 = unsigned int; Arg4 = Tp::DBusError*; Tp::MemberFunctor4<R, T, Arg1, Arg2, Arg3, Arg4>::ResultType = void]
ResultType operator()(Arg1 a1, Arg2 a2, Arg3 a3, Arg4 a4) const { return (o
^
/usr/include/telepathy-qt5/TelepathyQt/functors.h:168:16: note: candidate expects 4 arguments, 3 provided
In file included from /usr/include/telepathy-qt5/TelepathyQt/Callbacks:8:0,
from /usr/include/telepathy-qt5/TelepathyQt/base-channel.h:32,
from /usr/include/telepathy-qt5/TelepathyQt/BaseChannel:8,
from /tmp/yaourt-tmp-ubuntu/aur-telepathy-hanging-git/src/telepathy-hanging/hangingtextchannel.h:26,
from /tmp/yaourt-tmp-ubuntu/aur-telepathy-hanging-git/src/telepathy-hanging/hangingtextchannel.cpp:20:
/usr/include/telepathy-qt5/TelepathyQt/callbacks.h:211:43: error: return-statement with a value, in function returning 'void' [-fpermissive]
return (typed->functor)(a1, a2, a3);
^
CMakeFiles/telepathy-hanging.dir/build.make:134: recipe for target 'CMakeFiles/telepathy-hanging.dir/hangingtextchannel.cpp.o' failed
make[2]: *** [CMakeFiles/telepathy-hanging.dir/hangingtextchannel.cpp.o] Error 1
CMakeFiles/Makefile2:67: recipe for target 'CMakeFiles/telepathy-hanging.dir/all' failed
make[1]: *** [CMakeFiles/telepathy-hanging.dir/all] Error 2
Makefile:127: recipe for target 'all' failed
make: *** [all] Error 2
==> ERROR: A failure occurred in package_telepathy-hanging-git().
Aborting...
==> ERROR: Makepkg was unable to build telepathy-hanging-git.
==> Restart building telepathy-hanging-git ? [y/N]
==> ----------------------------------------------
==>

pavbaranov commented on 2015-09-27 09:36

Missing dependiences: libhangish-git.. Please add to PKGBUILD.