Package Details: telepathy-morse-git r196.bf8b134-1

Git Clone URL: https://aur.archlinux.org/telepathy-morse-git.git (read-only)
Package Base: telepathy-morse-git
Description: Telepathy Connection Manager for the Telegram network
Upstream URL: https://projects.kde.org/telepathy-morse/
Licenses: GPL
Conflicts: telepathy-morse
Provides: telepathy-morse
Submitter: arojas
Maintainer: ItachiSan
Last Packager: ItachiSan
Votes: 39
Popularity: 0.010519
First Submitted: 2014-10-20 19:36
Last Updated: 2017-11-06 13:43

Latest Comments

1 2 3 Next › Last »

Thaodan commented on 2018-01-01 00:04

upstream url is wrong.

Thaodan commented on 2018-01-01 00:03

please look on telegram-qt-git

kalib commented on 2017-12-18 13:00

@ItachiSan Also failing when I try to run yaourt -Sy telegram-qt-git:

/usr/include/openssl/ossl_typ.h:110:16: note: forward declaration of ‘RSA {aka struct rsa_st}’ typedef struct rsa_st RSA; ^~~~~~ /tmp/yaourt-tmp-kalib/aur-telegram-qt-git/src/telegram-qt/TelegramQt/Utils.cpp:282:54: error: invalid use of incomplete type ‘RSA {aka struct rsa_st}’ result.exponent = SslBigNumber::toByteArray(key->e); ^ In file included from /usr/include/openssl/bn.h:32:0, from /tmp/yaourt-tmp-kalib/aur-telegram-qt-git/src/telegram-qt/TelegramQt/Utils.cpp:21: /usr/include/openssl/ossl_typ.h:110:16: note: forward declaration of ‘RSA {aka struct rsa_st}’ typedef struct rsa_st RSA; ^~~~~~ make[2]: [TelegramQt/CMakeFiles/TelegramQt5.dir/build.make:447: TelegramQt/CMakeFiles/TelegramQt5.dir/Utils.cpp.o] Error 1 make[1]: [CMakeFiles/Makefile2:86: TelegramQt/CMakeFiles/TelegramQt5.dir/all] Error 2 make: *** [Makefile:130: all] Error 2 ==> ERROR: A failure occurred in build(). Aborting... ==> ERROR: Makepkg was unable to build telegram-qt-git. ==> Restart building telegram-qt-git ? [y/N] ==> ---------------------------------------- ==>

ItachiSan commented on 2017-11-13 12:17

@kalib I can properly build; I had a similar issue before and it was solved by updating `telegram-qt-git`.

kalib commented on 2017-11-10 23:07

It's failing...

-- Build files have been written to: /tmp/yaourt-tmp-kalib/aur-telepathy-morse-git/src/build
Scanning dependencies of target telepathy-morse_autogen
[ 9%] Automatic MOC for target telepathy-morse
Generating MOC predefs moc_predefs.h
Generating MOC source include/debug.moc
Generating MOC source EWIEGA46WW/moc_connection.cpp
Generating MOC source EWIEGA46WW/moc_contactgroups.cpp
Generating MOC source OUN5CIYSAV/moc_CFileManager.cpp
Generating MOC source EWIEGA46WW/moc_protocol.cpp
Generating MOC source EWIEGA46WW/moc_textchannel.cpp
Generating MOC compilation mocs_compilation.cpp
[ 9%] Built target telepathy-morse_autogen
Scanning dependencies of target telepathy-morse
[ 18%] Building CXX object CMakeFiles/telepathy-morse.dir/main.cpp.o
[ 27%] Building CXX object CMakeFiles/telepathy-morse.dir/connection.cpp.o
/tmp/yaourt-tmp-kalib/aur-telepathy-morse-git/src/telepathy-morse/connection.cpp:30:10: fatal error: TelegramQt/Debug: No such file or directory
#include <TelegramQt/Debug>
^~~~~~~~~~~~~~~~~~
compilation terminated.
make[2]: *** [CMakeFiles/telepathy-morse.dir/build.make:87: CMakeFiles/telepathy-morse.dir/connection.cpp.o] Error 1
make[1]: *** [CMakeFiles/Makefile2:68: CMakeFiles/telepathy-morse.dir/all] Error 2
make: *** [Makefile:130: all] Error 2
==> ERROR: A failure occurred in build().
Aborting...
==> ERROR: Makepkg was unable to build telepathy-morse-git.
==> Restart building telepathy-morse-git ? [y/N]
==> --------------------------------------------
==>


Any tip or sugestion?

ItachiSan commented on 2017-06-26 13:11

@hexdsl @rodneyrod
I also have a build issue, just reported it upstream:
https://github.com/TelepathyIM/telepathy-morse/issues/50

hexdsl commented on 2017-05-21 23:04

build error

make[2]: *** [CMakeFiles/telepathy-morse.dir/build.make:87: CMakeFiles/telepathy-morse.dir/connection.cpp.o] Error 1
make[1]: *** [CMakeFiles/Makefile2:68: CMakeFiles/telepathy-morse.dir/all] Error 2
make: *** [Makefile:130: all] Error 2
==> ERROR: A failure occurred in build().
Aborting...
:: failed to build telepathy-morse-git package(s)

rodneyrod commented on 2017-01-16 23:12

As of 15/01/2017 this package fails to compile, I'll try and get the error message posted soon.

Kaffeine commented on 2016-09-19 11:54

@arojas: FWIW, the release is there:

https://github.com/Kaffeine/telegram-qt/archive/telegram-qt-0.1.0.tar.gz
https://github.com/TelepathyQt/telepathy-morse/archive/telepathy-morse-0.1.0.tar.gz

arojas commented on 2016-09-13 15:39

@Kaffeine thanks for the explanation, looking forward to move this package to our repos when there's a stable release.