Package Details: terminal_velocity-git 0.1a7.r21.gbb2000b-2

Git Clone URL: (read-only)
Package Base: terminal_velocity-git
Description: A fast note-taking app for the UNIX terminal (patched)
Upstream URL:
Licenses: GPL
Submitter: immae
Maintainer: None
Last Packager: immae
Votes: 0
Popularity: 0.000000
First Submitted: 2016-10-30 10:00
Last Updated: 2017-03-01 15:38

Latest Comments

markoff commented on 2018-10-21 10:18

Can't install:

==> Starting pkgver()...
==> Updated version: terminal_velocity-git 0.1a7.r29.g6b1fee9-1
==> Sources are ready.
==> Making package: terminal_velocity-git 0.1a7.r29.g6b1fee9-1 (Sun 21 Oct 2018 11:15:08 WEST)
==> Checking runtime dependencies...
==> Checking buildtime dependencies...
==> WARNING: Using existing $srcdir/ tree
==> Starting pkgver()...
==> Starting build()...
patching file bin/terminal_velocity
patching file terminal_velocity/
Hunk #1 succeeded at 238 (offset 1 line).
Hunk #2 succeeded at 410 (offset 1 line).
Hunk #3 FAILED at 437.
1 out of 3 hunks FAILED -- saving rejects to file 
==> ERROR: A failure occurred in build().
Error making: terminal_velocity-git

Any suggestion?

immae commented on 2017-03-01 15:39

@kmacleod: It's fixed, the patch doesn't have any effect unless you put some specific command line arguments / configuration.

I'll put that upstream someday...

immae commented on 2017-03-01 15:16

(The other patch was applied upstream though)

immae commented on 2017-03-01 15:15

@kmacleod: Yes, I did it by personal preference (as far as I'm concerned, notes are atemporal), and I wanted to do an option but didn't take the time to do it at that time, and then forgot...

I'll try to do it soon :p

kmacleod commented on 2017-03-01 15:05

@immae I'm not sure why you're applying the sort notes patch. You're breaking the default sort functionality, which is sort by time. Personal preference? I'm just wondering, because I've removed the patch when I install. I don't see any PR in github to add different sort options, so I'm wondering if you plan to keep the patch in place. -thanks.

immae commented on 2017-01-19 08:58

@kmacleod: fixed. I finally took the time to make a PR to apply the patch upstream, expect the build to fail again soon if it is accepted

kmacleod commented on 2017-01-18 17:35

I'm getting this error on install:

Fetching origin
-> Found 001_fix_shell_escape.patch
-> Found 002_sort_found_notes.patch
==> Validating source files with sha1sums...
terminal_velocity ... Skipped
001_fix_shell_escape.patch ... Passed
002_sort_found_notes.patch ... Passed
==> Extracting sources...
-> Creating working copy of terminal_velocity git repo...
Switched to a new branch 'makepkg'
==> Starting pkgver()...
==> Starting build()...
patching file
Hunk #2 FAILED at 324.
1 out of 2 hunks FAILED -- saving rejects to file
==> ERROR: A failure occurred in build().
:: failed to build terminal_velocity-git package(s)

I removed the two patch commands and it installs fine. Not sure if they are still needed.