Package Details: tilp 1.18-1

Git Clone URL: https://aur.archlinux.org/tilp.git (read-only, click to copy)
Package Base: tilp
Description: TI graphing calculator link/transfer program
Upstream URL: http://lpg.ticalc.org/prj_tilp/
Keywords: ti tiemu tilem
Licenses: GPL2
Submitter: blinxwang
Maintainer: J5lx
Last Packager: J5lx
Votes: 28
Popularity: 0.022433
First Submitted: 2015-08-26 21:03 (UTC)
Last Updated: 2017-05-30 22:14 (UTC)

Latest Comments

J5lx commented on 2017-06-26 13:09 (UTC)

Firstly, sorry for the delay. I tried to figure out why the package wants libarchive.la but I still didn’t find anything. @nmaggioni, you mentioned that you solved the problem by building the packages manually with makepkg. Could you let me know how you tried to build the package before that? Also, did you experience any problems with libtifiles, since that is the only TI package that requires libarchive directly?

nmaggioni commented on 2017-06-21 12:01 (UTC) (edited on 2017-06-21 12:01 (UTC) by nmaggioni)

I solved the compilation error by manually makepkg'ing the [libticalcs](http://aur.archlinux.org/packages/libticalcs) package and its dependencies, and then manually installing TiLP. The error itself is caused by the missing `/usr/lib/libarchive.la` file, as confirmed by [its package contents](https://www.archlinux.org/packages/core/x86_64/libarchive/files/). By building the dependencies separatedly I guess that the environment pointed autoconf to the right library file.

J5lx commented on 2017-06-06 23:23 (UTC)

autoconf is part of base-devel and thus expected to be present at buildtime, just like other basic tools such as gcc or pkg-config. @Ketchup901 I’m sorry that I still haven’t gotten around to your error message. The message seems rather weird to say the least and I’ll have to experiment a little to figure out what might be going wrong.

Givralix commented on 2017-06-06 20:22 (UTC)

This needs autoconf as a dependency. Thanks for making this package, by the way.

Ketchup901 commented on 2017-06-01 13:44 (UTC)

Fails to build. I have the error lmao make[1]: Entering directory '/home/adam/.cache/pacaur/tilp/src/tilp2-1.18' Making all in build make[2]: Entering directory '/home/adam/.cache/pacaur/tilp/src/tilp2-1.18/build' Making all in mingw make[3]: Entering directory '/home/adam/.cache/pacaur/tilp/src/tilp2-1.18/build/mingw' make[3]: Nothing to be done for 'all'. make[3]: Leaving directory '/home/adam/.cache/pacaur/tilp/src/tilp2-1.18/build/mingw' make[3]: Entering directory '/home/adam/.cache/pacaur/tilp/src/tilp2-1.18/build' make[3]: Nothing to be done for 'all-am'. make[3]: Leaving directory '/home/adam/.cache/pacaur/tilp/src/tilp2-1.18/build' make[2]: Leaving directory '/home/adam/.cache/pacaur/tilp/src/tilp2-1.18/build' Making all in builder make[2]: Entering directory '/home/adam/.cache/pacaur/tilp/src/tilp2-1.18/builder' make[2]: Nothing to be done for 'all'. make[2]: Leaving directory '/home/adam/.cache/pacaur/tilp/src/tilp2-1.18/builder' Making all in desktop make[2]: Entering directory '/home/adam/.cache/pacaur/tilp/src/tilp2-1.18/desktop' make[2]: Nothing to be done for 'all'. make[2]: Leaving directory '/home/adam/.cache/pacaur/tilp/src/tilp2-1.18/desktop' Making all in help make[2]: Entering directory '/home/adam/.cache/pacaur/tilp/src/tilp2-1.18/help' make[2]: Nothing to be done for 'all'. make[2]: Leaving directory '/home/adam/.cache/pacaur/tilp/src/tilp2-1.18/help' Making all in icons make[2]: Entering directory '/home/adam/.cache/pacaur/tilp/src/tilp2-1.18/icons' make[2]: Nothing to be done for 'all'. make[2]: Leaving directory '/home/adam/.cache/pacaur/tilp/src/tilp2-1.18/icons' Making all in pixmaps make[2]: Entering directory '/home/adam/.cache/pacaur/tilp/src/tilp2-1.18/pixmaps' make[2]: Nothing to be done for 'all'. make[2]: Leaving directory '/home/adam/.cache/pacaur/tilp/src/tilp2-1.18/pixmaps' Making all in po make[2]: Entering directory '/home/adam/.cache/pacaur/tilp/src/tilp2-1.18/po' make[2]: Nothing to be done for 'all'. make[2]: Leaving directory '/home/adam/.cache/pacaur/tilp/src/tilp2-1.18/po' Making all in src make[2]: Entering directory '/home/adam/.cache/pacaur/tilp/src/tilp2-1.18/src' /bin/sh ../libtool --tag=CXX --mode=link g++ -march=x86-64 -mtune=generic -O2 -pipe -fstack-protector-strong -D__LINUX__ -fvisibility=hidden -DGTK_DISABLE_DEPRECATED -fno-rtti -fno-exceptions -export-dynamic -Wl,-O1,--sort-common,--as-needed,-z,relro -Wl,--export-dynamic -o tilp tilp-tilp_calcs.o tilp-tilp_cmdline.o tilp-tilp_config.o tilp-tilp_error.o tilp-tilp_files.o tilp-tilp_gif.o tilp-tilp_main.o tilp-tilp_misc.o tilp-tilp_paths.o tilp-tilp_screen.o tilp-tilp_slct.o tilp-tilp_update.o tilp-tilp_vars.o tilp-tilp_device.o tilp-tilp.o tilp-main.o tilp-about.o tilp-action.o tilp-bookmark.o tilp-clist.o tilp-clist_rbm.o tilp-clock.o tilp-ctree.o tilp-ctree_rbm.o tilp-dboxes.o tilp-device.o tilp-dnd.o tilp-filesel.o tilp-gtk_gif.o tilp-gtk_update.o tilp-labels.o tilp-manpage.o tilp-options.o tilp-pbars.o tilp-release.o tilp-screenshot.o tilp-scroptions.o tilp-splash.o tilp-support.o tilp-toolbar.o tilp-fileprop.o -lticables2 -ltifiles2 -lticalcs2 -lglib-2.0 -lticonv -lglib-2.0 -lgtk-x11-2.0 -lgdk-x11-2.0 -lpangocairo-1.0 -latk-1.0 -lcairo -lgdk_pixbuf-2.0 -lgio-2.0 -lpangoft2-1.0 -lpango-1.0 -lgobject-2.0 -lglib-2.0 -lfontconfig -lfreetype -lz libtool: error: cannot find the library '/usr/lib/libarchive.la' or unhandled argument '/usr/lib/libarchive.la' make[2]: *** [Makefile:518: tilp] Error 1 make[2]: Leaving directory '/home/adam/.cache/pacaur/tilp/src/tilp2-1.18/src' make[1]: *** [Makefile:516: all-recursive] Error 1 make[1]: Leaving directory '/home/adam/.cache/pacaur/tilp/src/tilp2-1.18' make: *** [Makefile:427: all] Error 2 ==> ERROR: A failure occurred in build(). Aborting... :: failed to build tilp package(s)

J5lx commented on 2017-05-31 21:19 (UTC)

succeeds to build Seriously, if I’m supposed to help you, you do need to tell me what exactly is going wrong. The package builds perfectly fine for me; I would not have uploaded it otherwise. If you can’t get it to build, please post at least the error message here.

piejacker875 commented on 2017-05-31 21:09 (UTC)

fails to build

GeneMarston commented on 2016-01-28 17:43 (UTC)

Something goes wrong for me... Could you take a look? http://pastebin.com/RcK0X4G7

parkerlreed commented on 2015-08-31 14:59 (UTC)

Thanks for bringing this over!