Package Details: timeshift 19.01-2

Git Clone URL: https://aur.archlinux.org/timeshift.git (read-only)
Package Base: timeshift
Description: A system restore utility for Linux
Upstream URL: https://github.com/teejee2008/timeshift
Licenses: GPL
Submitter: severach
Maintainer: severach
Last Packager: severach
Votes: 64
Popularity: 3.298460
First Submitted: 2015-08-19 07:22
Last Updated: 2019-01-30 20:33

Latest Comments

1 2 3 4 5 Next › Last »

BillFleming commented on 2019-03-10 05:35

For the schedule to actually work you need to properly enable the chron service which at least on Antergos isn't on by default. systemctl enable cronie.service systemctl start cronie.service

sbrl commented on 2019-02-20 22:09

Nope, it's broken for me. I'm getting this error:

error: The root namespace already contains a definition for `AppExcludeEntry'

(full log output is here: https://hastebin.com/ixowopames)

bishoptf commented on 2019-01-31 01:58

Looks like the latest update fixed the issue, Thanks!

ndowens04 commented on 2019-01-30 02:45

Regarding vala 42.5, here is how to fix it: sed -i 's:--thread:& Core/AppExcludeEntry.vala:' src/makefile

Skylead commented on 2019-01-28 21:14

Downgrading vala to 0.42.4-1 via # pacman -U worked for me

severach commented on 2019-01-28 04:36

downgrading works fine.

carzo commented on 2019-01-27 17:04

just installed arch and apparently can't downgrade vala. hoping this incompatibility issue gets fixed so I can continue messing with arch safely :)

great work severach!

severach commented on 2019-01-24 03:14

Its an incompatibility with vala 0.42.5. Builds fine in 0.42.4.

Skylead commented on 2019-01-23 19:09

Anyone else getting this error trying to update?

==> Making package: timeshift 19.01-1 (Wed 23 Jan 2019 02:05:29 PM EST) ==> Checking runtime dependencies... ==> Checking buildtime dependencies... ==> WARNING: Using existing $srcdir/ tree ==> Starting build()... Command-line option --thread is deprecated and will be ignored Core/Main.vala:64.23-64.37: error: The type name AppExcludeEntry' could not be found public Gee.ArrayList<AppExcludeEntry> exclude_list_apps; ^^^^^^^^^^^^^^^ Core/Main.vala:528.41-528.55: error: The type nameAppExcludeEntry' could not be found exclude_list_apps = new Gee.ArrayList<AppExcludeEntry>(); ^^^^^^^^^^^^^^^ Gtk/ExcludeAppsBox.vala:102.4-102.18: error: The type name AppExcludeEntry' could not be found AppExcludeEntry entry; ^^^^^^^^^^^^^^^ Gtk/ExcludeAppsBox.vala:113.4-113.18: error: The type nameAppExcludeEntry' could not be found AppExcludeEntry entry; ^^^^^^^^^^^^^^^ Gtk/ExcludeAppsBox.vala:126.4-126.18: error: The type name AppExcludeEntry' could not be found AppExcludeEntry entry; ^^^^^^^^^^^^^^^ Gtk/ExcludeAppsBox.vala:150.43-150.57: error: The type nameAppExcludeEntry' could not be found var model = new Gtk.ListStore(3, typeof(AppExcludeEntry), typeof(bool), typeof(string)); ^^^^^^^^^^^^^^^ Compilation failed: 6 error(s), 0 warning(s) make[1]: [makefile:52: app-gtk] Error 1 make: [makefile:2: all] Error 2 /usr/bin/makepkg: line 342: logpipe: unbound variable Error making: timeshift

Geeko commented on 2018-12-23 17:56

Can you add vte3 to depends (not makedepends)? It doesn't run without it.