Package Details: timeshift 19.01-3

Git Clone URL: https://aur.archlinux.org/timeshift.git (read-only)
Package Base: timeshift
Description: A system restore utility for Linux
Upstream URL: https://github.com/teejee2008/timeshift
Licenses: GPL
Submitter: severach
Maintainer: severach
Last Packager: severach
Votes: 68
Popularity: 4.551918
First Submitted: 2015-08-19 07:22
Last Updated: 2019-06-11 04:24

Latest Comments

« First ‹ Previous 1 2 3 4 5 Next › Last »

carzo commented on 2019-01-27 17:04

just installed arch and apparently can't downgrade vala. hoping this incompatibility issue gets fixed so I can continue messing with arch safely :)

great work severach!

severach commented on 2019-01-24 03:14

Its an incompatibility with vala 0.42.5. Builds fine in 0.42.4.

Skylead commented on 2019-01-23 19:09

Anyone else getting this error trying to update?

==> Making package: timeshift 19.01-1 (Wed 23 Jan 2019 02:05:29 PM EST) ==> Checking runtime dependencies... ==> Checking buildtime dependencies... ==> WARNING: Using existing $srcdir/ tree ==> Starting build()... Command-line option --thread is deprecated and will be ignored Core/Main.vala:64.23-64.37: error: The type name AppExcludeEntry' could not be found public Gee.ArrayList<AppExcludeEntry> exclude_list_apps; ^^^^^^^^^^^^^^^ Core/Main.vala:528.41-528.55: error: The type nameAppExcludeEntry' could not be found exclude_list_apps = new Gee.ArrayList<AppExcludeEntry>(); ^^^^^^^^^^^^^^^ Gtk/ExcludeAppsBox.vala:102.4-102.18: error: The type name AppExcludeEntry' could not be found AppExcludeEntry entry; ^^^^^^^^^^^^^^^ Gtk/ExcludeAppsBox.vala:113.4-113.18: error: The type nameAppExcludeEntry' could not be found AppExcludeEntry entry; ^^^^^^^^^^^^^^^ Gtk/ExcludeAppsBox.vala:126.4-126.18: error: The type name AppExcludeEntry' could not be found AppExcludeEntry entry; ^^^^^^^^^^^^^^^ Gtk/ExcludeAppsBox.vala:150.43-150.57: error: The type nameAppExcludeEntry' could not be found var model = new Gtk.ListStore(3, typeof(AppExcludeEntry), typeof(bool), typeof(string)); ^^^^^^^^^^^^^^^ Compilation failed: 6 error(s), 0 warning(s) make[1]: [makefile:52: app-gtk] Error 1 make: [makefile:2: all] Error 2 /usr/bin/makepkg: line 342: logpipe: unbound variable Error making: timeshift

Geeko commented on 2018-12-23 17:56

Can you add vte3 to depends (not makedepends)? It doesn't run without it.

severach commented on 2018-07-25 01:36

cronie is the only repo package that provides crontab so I changed the depends to cronie. I'll wait for complaints from other cron compatible packages on the AUR to see if there's a better way to get cron.

Arch generally doesn't automatically enable services. Cronie and timeshift are not related and cronie is only needed for automatic backups. What I can do is harass you on each package upgrade until you enable it.

navarroaxel commented on 2018-07-21 03:20

Can you add this step when you install timeshift from the AUR?

systemctl enable cronie.service
systemctl start cronie.service

Without this service enabled Timeshift can't backup automatically the OS. Or where we can put this in the Arch Wiki or a pinned comment here. Because I had tried a lot of things until discover that I have to enable cronie.

navarroaxel commented on 2018-07-21 03:16

When I install timeshift aurman ask to me if I want to choose cronie or fcron as a cron provider, but the author says fcron is not supported https://github.com/teejee2008/timeshift/issues/151. Can you change the package dependencies to fix this?

severach commented on 2018-06-01 19:41

I've see pacman 5.0 mishandle deps before. So far it has been too rare to report and I've only seen it on Antergos.

ReiLucio commented on 2018-05-31 06:22

Got this after "pacman -Rns $(pacman -Qtdq)" removed vte3(marked as make):

$ timeshift timeshift: error while loading shared libraries: libvte-2.91.so.0: cannot open shared object file: No such file or directory

"pacman -Syu vte3" fixed it, then "pacman -Rns $(pacman -Qtdq)" does not returned vte3 anymore as a orphan.

Aladar commented on 2017-11-03 07:53

The new version finally needs Vala 0.38, for anyone running into problems.