Package Details: timeshift 19.01-3

Git Clone URL: (read-only)
Package Base: timeshift
Description: A system restore utility for Linux
Upstream URL:
Licenses: GPL
Submitter: severach
Maintainer: severach
Last Packager: severach
Votes: 71
Popularity: 4.718422
First Submitted: 2015-08-19 07:22
Last Updated: 2019-06-11 04:24

Latest Comments

« First ‹ Previous 1 2 3 4 5

Maxiride commented on 2016-07-07 07:42

Got a couple of issue, don't know if I should report it to the software releaser or if an issue related to this package.

Settings-> Planned backups: I can only tick the options, clicking again won't untick the option

Always about planned backups I enabled the daily ones but after a week when I reopened timeshift no backups have been done.

Maxiride commented on 2016-06-25 07:23

@severach indeed, thank you very much. Install successful.

severach commented on 2016-06-24 17:13

Building in a clean chroot showed that vte3 is required.

Maxiride commented on 2016-06-24 16:22

Having the same error as @irishwoody plus some missing variable at the end of the compilation:

/tmp/yaourt-tmp-federico/aur-timeshift/src/~teejee2008/timeshift/trunk/src/TerminalWindow.vala.c:30:21: fatal error: vte/vte.h: File o directory non esistente
#include <vte/vte.h>
compilation terminated.
error: cc exited with status 256
Compilation failed: 1 error(s), 15 warning(s)
make[1]: *** [makefile:17: all] Error 1
make: *** [makefile:2: all] Error 2
/usr/bin/makepkg: riga 729: logpipe: variabile non assegnata ==> variable unassigned
==> ERRORE: Makepkg non è riuscito a compilare timeshift.
==> Riavviare la compilazione di timeshift [s/N]
==> --------------------------------------------

irishwoody commented on 2016-06-22 08:44

version 16.3-1 does not seem to build correclty. The following is error message.

==> Retrieving sources...
-> Found timeshift_v16.3_r186.tgz
-> Found sha256sums.txt
==> Validating source files with sha256sums...
timeshift_v16.3_r186.tgz ... Skipped
sha256sums.txt ... Skipped
==> Extracting sources...
-> Extracting timeshift_v16.3_r186.tgz with bsdtar
==> Starting prepare()...
Files sha256sums.txt and sha256sums.test differ
==> ERROR: A failure occurred in prepare().

ottomops commented on 2016-06-22 07:29

Keep getting an error when trying to install the latest version...

==> Beginne prepare()...
Files sha256sums.txt and sha256sums.test differ

RobinHood2015 commented on 2016-04-18 06:13

Please add cronie as a dependency package. Timeshift will not run without crontab, which cronie provides.

Thank you.

redbaron commented on 2015-10-29 07:39

Works after editing PKGBUILD:

- _ubver='1.7.3~177~ubuntu14.04.1'; _libgee='libgee>=0.18.0'
+ _ubver='1.7.5~180~ubuntu14.04.1'; _libgee='libgee>=0.18.0'


- sha256sums=('eaf30b0ed47fab1f15c896ed06008f2f15839c66ce891130311fef4bff860b32')
+ sha256sums=('b7c411ce6677e19d7c2114565c820f3c0eab8dc26e151367c28f87c51da66027')