Package Details: tin 2.4.5-1

Git Clone URL: https://aur.archlinux.org/tin.git (read-only, click to copy)
Package Base: tin
Description: A threaded NNTP and spool based UseNet newsreader.
Upstream URL: http://www.tin.org
Licenses: BSD
Conflicts: tin-unstable
Submitter: ilpianista
Maintainer: aksr
Last Packager: aksr
Votes: 27
Popularity: 0.125188
First Submitted: 2010-11-13 15:32
Last Updated: 2021-01-16 11:24

Latest Comments

« First ‹ Previous 1 2

Thah commented on 2013-05-23 09:51

I got it to kind of work:

I got the tarball via www.tin.org (tin-current which should be v2.0.1), executed the build() function content by hand in that source directory and moved *that* directory to tin/src/, thereby replacing the old tin/src/tin-2.0.1 with the one with the sucessfull build.

A makepkg -R then created the package and it seems to work for now.

I have not the slightest idea why that worked, though.

Thah commented on 2013-05-23 09:51

I got it to kind of work:

I got the tarball via www.tin.org (tin-current which should be v2.0.1), executed the build() function content by hand in that source directory and moved *that* directory to tin/src/, thereby replacing the old tin/src/tin-2.0.1 with the one with the sucessfull build.

A makepkg -R then created the package and it seems to work for now.

I have not the slightest idea why that worked, though.

Bonster commented on 2013-04-16 03:46

This package broken now?

----------------
./makecfg.c: In function ‘string_dup’:
./makecfg.c:85:9: warning: incompatible implicit declaration of built-in function ‘strcpy’ [enabled by default]
return strcpy((char *) malloc(strlen(string) + 1), string);
^
./makecfg.c:85:32: warning: incompatible implicit declaration of built-in function ‘strlen’ [enabled by default
]
return strcpy((char *) malloc(strlen(string) + 1), string);
^
./makecfg.c: In function ‘parse_tbl’:
./makecfg.c:116:16: warning: incompatible implicit declaration of built-in function ‘strlen’ [enabled by defaul
t]
char *t = s + strlen(s);
^
./makecfg.c: In function ‘generate_ptr’:
./makecfg.c:354:22: warning: incompatible implicit declaration of built-in function ‘strlen’ [enabled by defaul
t]
MAXNAME - (int)(strlen(addr) + strlen(p->name)),
^
make[2]: *** [makecfg] Error 1
make[2]: Leaving directory `/tmp/yaourt-tmp-heoyea-br/aur-tin/src/tin-2.0.1/src'
make[1]: *** [install] Error 2
make[1]: Leaving directory `/tmp/yaourt-tmp-heoyea-br/aur-tin/src/tin-2.0.1/src'
make: *** [install] Error 2
==> ERROR: A failure occurred in package().
Aborting...
==> ERROR: Makepkg was unable to build tin.
==> Restart building tin ? [y/N]
==> ----------------------------

Anonymous comment on 2012-03-04 20:42

Fixed. Thanks for reporting.

veox commented on 2012-03-04 16:35

I got a curses error and had to specify '--with-screen=ncursesw' to compile.

Anonymous comment on 2012-02-27 14:20

If you get an error like this, you only need to rebuild this package.

error while loading shared libraries: libpcre.so.0: cannot open shared object file: No such file or directory

Anonymous comment on 2011-08-27 10:06

A patch for upgrading 1.8.3 -> 2.0.0

diff -r tin/PKGBUILD tin-new/PKGBUILD
4c4
< pkgver=1.8.3
---
> pkgver=2.0.0
13c13
< md5sums=('e6ed45205020665c097556822b0d575b'
---
> md5sums=('b4072dc8004a7e5ee7dd16c887ffa09c'
28c28
< mv $pkgdir/usr/bin/url_handler.sh $pkgdir/usr/bin/tin_url_handler.sh
---
> mv $pkgdir/usr/bin/url_handler.pl $pkgdir/usr/bin/tin_url_handler.pl

ilpianista commented on 2010-11-13 15:32

* moved from [extra]