Package Details: tinc-pre 1.1pre18-1

Git Clone URL: https://aur.archlinux.org/tinc-pre.git (read-only, click to copy)
Package Base: tinc-pre
Description: VPN (Virtual Private Network) daemon (Pre-release)
Upstream URL: http://www.tinc-vpn.org/
Keywords: cryptography daemon mesh network vpn
Licenses: GPL
Conflicts: tinc, tinc-pre-systemd
Provides: tinc-pre, tinc-pre-systemd
Submitter: None
Maintainer: hexchain
Last Packager: hexchain
Votes: 14
Popularity: 0.000499
First Submitted: 2011-11-26 00:09 (UTC)
Last Updated: 2021-06-28 11:46 (UTC)

Latest Comments

kseistrup commented on 2019-10-18 12:56 (UTC)

The packacge ought to depend also on automake (for aclocal).

FirefighterBlu3 commented on 2017-06-13 07:35 (UTC)

└─>diff -ruN PKGBUILD~ PKGBUILD --- PKGBUILD~ 2017-06-13 03:33:59.000000000 -0400 +++ PKGBUILD 2017-06-13 03:34:21.766021042 -0400 @@ -4,7 +4,7 @@ pkgver=1.1pre14 pkgrel=3 pkgdesc="VPN (Virtual Private Network) daemon (Pre-release)" -arch=(i686 x86_64 armv7h) +arch=(i686 x86_64 armv7h armv6h) url="http://www.tinc-vpn.org/" license=('GPL') depends=('lzo' 'zlib' 'openssl-1.0' 'miniupnpc')

FirefighterBlu3 commented on 2017-06-13 07:33 (UTC)

please add armv6h to arch. tinc-pre compiles and works exactly as expected on this architecture with no additional effort needed.

hexchain commented on 2017-06-06 02:29 (UTC)

@DarkShadow44: Please rebuild tinc-pre against new openssl-1.0.

DarkShadow44 commented on 2017-06-05 20:18 (UTC)

Ok, it seems to work now - after rebuilding tinc. Though I thought openssl was backwards compatible, so don't really understand why.

DarkShadow44 commented on 2017-06-05 18:33 (UTC)

tinc: /usr/lib/libcrypto.so.1.0.0: version `OPENSSL_1.0.2d' not found (required by tinc) I can circumvent the problem by downgrading openssl-1.0, but could you maybe look into this?

maddie commented on 2017-05-09 16:05 (UTC)

@hexchain: You're welcome :)

hexchain commented on 2017-05-08 07:13 (UTC)

@maddie: Done, and thanks!

maddie commented on 2017-05-08 07:07 (UTC)

openssl package has been updated to 1.1, now it won't build. please update dependency to openssl-1.0 until this is fixed upstream

FirefighterBlu3 commented on 2016-12-26 03:16 (UTC)

please add armv6h to arch

kseistrup commented on 2016-10-26 13:10 (UTC)

The provided service files are using "ExecStart=/usr/sbin/tincd" and "ExecReload=/usr/sbin/tinc -n %i reload", but both tinc and tincd are located in /usr/bin.

kseistrup commented on 2016-10-26 12:32 (UTC)

Please add 'armv7h' architecture to PKGBUILD so that it will build on e.g. Raspberry PI.

hexchain commented on 2016-10-26 08:51 (UTC)

Unflagged, because the only difference between pre13 and pre14 is the return of tinc.service. But I will definitely upgrade to pre14, and thanks for noticing.

hexchain commented on 2016-05-01 07:37 (UTC) (edited on 2016-05-01 12:10 (UTC) by hexchain)

Updated to 1.1pre13. tinc.service was removed upstream but I haven't figured out how to maintain its behavior, so I temporarily added it back. UPDATE: upstream added tinc.service back.

hexchain commented on 2016-04-24 15:21 (UTC)

Starting from 1.1pre12, tinc ships its own systemd unit files, which are different from previous ones: 1. Unit file name changes from tincd(@) to tinc(@) 2. Network without network name is not supported anymore 3. tinc.service now serves to start all tinc@.service Please reload systemd and do appropriate configuration according to these changes.

hexchain commented on 2016-02-19 14:43 (UTC)

Just-Punk: That error does not affect usage, but I'm trying to figure it out. Manually executing these commands in .install does not give such error. Thanks for reporting.

Just-Punk commented on 2016-02-19 14:22 (UTC)

Compiled ok. But: ---- :: Proceed with installation? [Y/n] y (1/1) checking keys in keyring [###############################] 100% (1/1) checking package integrity [###############################] 100% (1/1) loading package files [###############################] 100% (1/1) checking for file conflicts [###############################] 100% (1/1) checking available disk space [###############################] 100% :: Processing package changes... (1/1) installing tinc-pre [###############################] 100% gzip: standard input: Bad file descriptor install-info: warning: no info dir entry in `/usr/share/info/tinc.info.gz' ------------------------- If it's important for somebody...

ivanc commented on 2015-10-05 02:03 (UTC)

Since I don't have much maintain this recently, anyone who have interest can adopt it.

hexchain commented on 2015-09-11 04:39 (UTC)

There's a syntax error in PKGBUILD, around line 26.

Lassulus commented on 2014-12-29 03:37 (UTC)

since i dont use this really anymore someone else could adopt it.

hexchain commented on 2014-12-20 10:30 (UTC)

The "./configure" line should have a new parameter: --sbindir=/usr/bin to make pacman 4.2 happy.

devkid commented on 2014-03-18 19:36 (UTC)

Could you please add systemd service files for this package? The package from the community repo includes those and for tinc-pre they are available in the tinc-pre-systemd AUR package. (But not working correctly, note my comment for this package.)

Mic92 commented on 2014-03-07 14:40 (UTC)

I had a custom compiler flag in my makepkg.conf causing this issue: -flto

Mic92 commented on 2014-03-07 14:08 (UTC)

Got the following linking error, when compiling this package: sptps.o (symbol from plugin): warning: memset used with constant zero length parameter; this could be due to transposed parameters /usr/sbin/ld: /tmp/cc3likrn.ltrans0.ltrans.o: relocation R_X86_64_32S against `hexadecimals.3423' can not be used when making a shared object; recompile with -fPIC /tmp/cc3likrn.ltrans0.ltrans.o: error adding symbols: Bad value collect2: Fehler: ld gab 1 als Ende-Status zurück Makefile:626: recipe for target 'sptps_test' failed make[2]: *** [sptps_test] Error 1 make[2]: *** Warte auf noch nicht beendete Prozesse... sptps.o (symbol from plugin): warning: memset used with constant zero length parameter; this could be due to transposed parameters /usr/sbin/ld: /tmp/ccW6TjAp.ltrans0.ltrans.o: relocation R_X86_64_32 against `.rodata.str1.1' can not be used when making a shared object; recompile with -fPIC /tmp/ccW6TjAp.ltrans0.ltrans.o: error adding symbols: Bad value collect2: Fehler: ld gab 1 als Ende-Status zurück Makefile:604: recipe for target 'sptps_speed' failed make[2]: *** [sptps_speed] Error 1 sptps.o (symbol from plugin): warning: memset used with constant zero length parameter; this could be due to transposed parameters /usr/sbin/ld: /tmp/ccYpON6D.ltrans0.ltrans.o: relocation R_X86_64_32 against `.rodata.str1.1' can not be used when making a shared object; recompile with -fPIC /tmp/ccYpON6D.ltrans0.ltrans.o: error adding symbols: Bad value collect2: Fehler: ld gab 1 als Ende-Status zurück Makefile:640: recipe for target 'tinc' failed make[2]: *** [tinc] Error 1 sptps.o (symbol from plugin): warning: memset used with constant zero length parameter; this could be due to transposed parameters /usr/include/bits/socket2.h: In Funktion »receive_meta«: /usr/include/bits/socket2.h:39:2: Warnung: Aufruf von »__recv_chk_warn« mit Attributwarnung deklariert: recv called with bigger length than size of destination buffer [standardmäßig aktiviert] return __recv_chk (__fd, __buf, __n, __bos0 (__buf), __flags); ^ /usr/sbin/ld: /tmp/ccLLieAI.ltrans0.ltrans.o: relocation R_X86_64_32 against `free_config' can not be used when making a shared object; recompile with -fPIC /tmp/ccLLieAI.ltrans0.ltrans.o: error adding symbols: Bad value collect2: Fehler: ld gab 1 als Ende-Status zurück Makefile:686: recipe for target 'tincd' failed make[2]: *** [tincd] Error 1 make[2]: Leaving directory '/tmp/yaourt-tmp-joerg/aur-tinc-pre/src/tinc-1.1pre10/src' Makefile:364: recipe for target 'all-recursive' failed make[1]: *** [all-recursive] Error 1 make[1]: Leaving directory '/tmp/yaourt-tmp-joerg/aur-tinc-pre/src/tinc-1.1pre10' Makefile:304: recipe for target 'all' failed make: *** [all] Error 2