Package Details: tmate 2.2.1-2

Git Clone URL: https://aur.archlinux.org/tmate.git (read-only)
Package Base: tmate
Description: Instant Terminal Sharing
Upstream URL: http://tmate.io/
Licenses: BSD
Submitter: huma
Maintainer: ogarcia
Last Packager: ogarcia
Votes: 34
Popularity: 0.045636
First Submitted: 2013-06-17 20:41
Last Updated: 2016-07-07 09:21

Latest Comments

1 2 Next › Last »

melvinvermeeren commented on 2016-02-23 20:18

@yogo1212 Install base-devel before using AUR (check wiki).

yogo1212 commented on 2015-09-23 18:48

hey - just another guy on the internet bothering you here :-D

./autogen.sh: line 16: aclocal: command not found

can you add the 'automake' and 'autoconf' dependencies pls?

have a nice day

yogo1212 commented on 2015-09-23 18:40

hey - just another guy on the internet bothering you here :-D

./autogen.sh: line 16: aclocal: command not found

can you add the automake dependency pls?

have a nice day

bhushan commented on 2015-07-22 03:57

AUR4 version updated, Thanks solarce

solarce commented on 2015-06-05 20:09

A fix for the compiling and an update to 1.8.10-1 is available at https://github.com/solarce/tmate-aur

eMyller commented on 2015-05-12 13:23

Hi. Currently the package is broken; it fails to compile with the error below.

libssh packages are installed.

```
src/CMakeFiles/ssh_static.dir/build.make:54: recipe for target 'src/CMakeFiles/ssh_static.dir/agent.c.o' failed
make[4]: *** [src/CMakeFiles/ssh_static.dir/agent.c.o] Error 1
make[4]: Leaving directory '/tmp/pacaurtmp-emyller/tmate/src/tmate/libssh/build'
CMakeFiles/Makefile2:159: recipe for target 'src/CMakeFiles/ssh_static.dir/all' failed
make[3]: *** [src/CMakeFiles/ssh_static.dir/all] Error 2
make[3]: Leaving directory '/tmp/pacaurtmp-emyller/tmate/src/tmate/libssh/build'
CMakeFiles/Makefile2:171: recipe for target 'src/CMakeFiles/ssh_static.dir/rule' failed
make[2]: *** [src/CMakeFiles/ssh_static.dir/rule] Error 2
make[2]: Leaving directory '/tmp/pacaurtmp-emyller/tmate/src/tmate/libssh/build'
Makefile:183: recipe for target 'ssh_static' failed
make[1]: *** [ssh_static] Error 2
make[1]: Leaving directory '/tmp/pacaurtmp-emyller/tmate/src/tmate/libssh/build'
Makefile:1506: recipe for target 'libssh/build/src/libssh.a' failed
make: *** [libssh/build/src/libssh.a] Error 2
==> ERROR: A failure occurred in build().
```

huma commented on 2013-12-27 14:18

Thank you all. Updated to the latest 1.8.9 release.

Invie commented on 2013-12-23 22:43

I posted an update to the PKGBUILD here. For the 1.8.9 version.

https://bbs.archlinux.org/viewtopic.php?pid=1363022#p1363022

adlaiff6 commented on 2013-12-12 14:51

ruby should be a dependency

josemota commented on 2013-09-17 08:43

@huma, didn't realize the release-only policy. Sorry about that.
Still, there is some error in the latest version. I tried upgrading the package and I get this error:

===

gcc -march=x86-64 -mtune=generic -O2 -pipe -fstack-protector --param=ssp-buffer-size=4 -D_GNU_SOURCE -Wno-unused-parameter -Wno-unused-variable -Ilibssh/include/ -Imsgpack/src -rdynamic -std=gnu99 -O2 -Wl,-O1,--sort-common,--as-needed,-z,relro -o tmate arguments.o attributes.o cfg.o client.o clock.o cmd-attach-session.o cmd-bind-key.o cmd-break-pane.o cmd-capture-pane.o cmd-choose-buffer.o cmd-choose-client.o cmd-choose-list.o cmd-choose-tree.o cmd-clear-history.o cmd-clock-mode.o cmd-command-prompt.o cmd-confirm-before.o cmd-copy-mode.o cmd-delete-buffer.o cmd-detach-client.o cmd-display-message.o cmd-display-panes.o cmd-find-window.o cmd-has-session.o cmd-if-shell.o cmd-join-pane.o cmd-kill-pane.o cmd-kill-server.o cmd-kill-session.o cmd-kill-window.o cmd-link-window.o cmd-list-buffers.o cmd-list-clients.o cmd-list-commands.o cmd-list-keys.o cmd-list-panes.o cmd-list-sessions.o cmd-list-windows.o cmd-list.o cmd-load-buffer.o cmd-lock-server.o cmd-move-window.o cmd-new-session.o cmd-new-window.o cmd-paste-buffer.o cmd-pipe-pane.o cmd-queue.o cmd-refresh-client.o cmd-rename-session.o cmd-rename-window.o cmd-resize-pane.o cmd-respawn-pane.o cmd-respawn-window.o cmd-rotate-window.o cmd-run-shell.o cmd-save-buffer.o cmd-select-layout.o cmd-select-pane.o cmd-select-window.o cmd-send-keys.o cmd-server-info.o cmd-set-buffer.o cmd-set-environment.o cmd-set-option.o cmd-show-environment.o cmd-show-messages.o cmd-show-options.o cmd-source-file.o cmd-split-window.o cmd-start-server.o cmd-string.o cmd-suspend-client.o cmd-swap-pane.o cmd-swap-window.o cmd-switch-client.o cmd-unbind-key.o cmd-unlink-window.o cmd-wait-for.o cmd.o colour.o control.o control-notify.o environ.o format.o grid-cell.o grid-view.o grid.o input-keys.o input.o job.o key-bindings.o key-string.o layout-custom.o layout-set.o layout.o log.o mode-key.o names.o notify.o options-table.o options.o paste.o resize.o screen-redraw.o screen-write.o screen.o server-client.o server-fn.o server-window.o server.o session.o signal.o status.o tmate-debug.o tmate-ssh-client.o tmate-encoder.o tmate-decoder.o tmate-msg.o tmate-session.o tmux.o tty-acs.o tty-keys.o tty-term.o tty.o utf8.o window-choose.o window-clock.o window-copy.o window.o xmalloc.o xterm-keys.o osdep-linux.o imsg.o imsg-buffer.o closefrom.o strlcat.o strlcpy.o fgetln.o getopt.o vis.o unvis.o strtonum.o libssh/build/src/libssh.a msgpack/src/.libs/libmsgpackc.a -lutil -lcurses -levent -lssl -lcrypto -lz -lresolv
libssh/build/src/libssh.a(gssapi.c.o): In function `ssh_gssapi_log_error':
gssapi.c:(.text+0x24): undefined reference to `gss_display_status'
libssh/build/src/libssh.a(gssapi.c.o): In function `ssh_gssapi_match.constprop.3':
gssapi.c:(.text+0x138): undefined reference to `gss_create_empty_oid_set'
gssapi.c:(.text+0x148): undefined reference to `gss_indicate_mechs'
gssapi.c:(.text+0x1e0): undefined reference to `GSS_C_NT_USER_NAME'
gssapi.c:(.text+0x1eb): undefined reference to `gss_import_name'
gssapi.c:(.text+0x261): undefined reference to `GSS_C_NT_HOSTBASED_SERVICE'
gssapi.c:(.text+0x281): undefined reference to `gss_import_name'
gssapi.c:(.text+0x375): undefined reference to `gss_init_sec_context'
gssapi.c:(.text+0x39e): undefined reference to `gss_add_oid_set_member'
gssapi.c:(.text+0x3c8): undefined reference to `gss_delete_sec_context'
gssapi.c:(.text+0x429): undefined reference to `gss_create_empty_oid_set'
gssapi.c:(.text+0x439): undefined reference to `gss_add_oid_set_member'
gssapi.c:(.text+0x46c): undefined reference to `gss_acquire_cred'
gssapi.c:(.text+0x47d): undefined reference to `gss_release_oid_set'
gssapi.c:(.text+0x498): undefined reference to `gss_release_cred'
gssapi.c:(.text+0x4a8): undefined reference to `gss_add_oid_set_member'
libssh/build/src/libssh.a(gssapi.c.o): In function `ssh_packet_userauth_gssapi_response':
gssapi.c:(.text+0x99f): undefined reference to `gss_init_sec_context'
gssapi.c:(.text+0xa8c): undefined reference to `gss_create_empty_oid_set'
gssapi.c:(.text+0xa9a): undefined reference to `gss_add_oid_set_member'
gssapi.c:(.text+0xacf): undefined reference to `gss_acquire_cred'
gssapi.c:(.text+0xadd): undefined reference to `gss_release_oid_set'
libssh/build/src/libssh.a(gssapi.c.o): In function `ssh_packet_userauth_gssapi_token_client':
gssapi.c:(.text+0xc9c): undefined reference to `gss_init_sec_context'
gssapi.c:(.text+0xe8a): undefined reference to `gss_get_mic'
gssapi.c:(.text+0x1034): undefined reference to `gss_release_cred'
collect2: error: ld returned 1 exit status
make: *** [tmate] Error 1
==> ERROR: A failure occurred in build().
Aborting...
The build failed.