Package Details: tomahawk 0.8.4-4

Git Clone URL: https://aur.archlinux.org/tomahawk.git (read-only)
Package Base: tomahawk
Description: A Music Player App written in C++/Qt
Upstream URL: http://tomahawk-player.org/
Licenses: GPL3
Submitter: zizzfizzix
Maintainer: arcanis
Last Packager: arcanis
Votes: 191
Popularity: 0.035244
First Submitted: 2011-03-25 11:03
Last Updated: 2016-01-07 14:45

Dependencies (21)

Required by (0)

Sources (2)

Pinned Comments

sudoBash418 commented on 2017-04-28 20:41

"Install either phonon-qt4-gstreamer or phonon-qt4-vlc."

That should be pinned, as I (and I'm sure others) have spend a long time trying to figuring out why tomahawk wouldn't play music!

Latest Comments

1 2 3 4 5 6 ... Next › Last »

prometheus commented on 2018-01-20 15:17

From the github page: https://github.com/tomahawk-player/tomahawk

This project is essentially abandoned

There is noone working on it. There isn't much sense in adding any new issues in the issue tracker unless you want to fix them yourself.

EarthMind commented on 2017-06-10 08:59

It doesn't work unfortunately, because I get an error that the package is corrupt.

arcanis commented on 2017-06-07 10:21

@EarthMind
just rebuild it

EarthMind commented on 2017-06-06 21:09

Tomahawk broke with the 1.64 boost package upgrade.

Error:

tomahawk: error while loading shared libraries: libboost_filesystem.so.1.63.0: cannot open shared object file: No such file or directory

sudoBash418 commented on 2017-04-28 20:41

"Install either phonon-qt4-gstreamer or phonon-qt4-vlc."

That should be pinned, as I (and I'm sure others) have spend a long time trying to figuring out why tomahawk wouldn't play music!

arcanis commented on 2017-04-28 13:46

did you try qt5 version? :)

jbochicchio commented on 2017-04-25 17:44

Having the same problems as LadyOutlaw and jwynn6. I think it has something to do with qtwebkit, as I can't get it to compile on its own. If you check out the qtwebkit page, compilation errors are popping up as of the 22nd.

jwynn6 commented on 2017-03-23 16:00

Having the same problem as LadyOutlaw

https://gist.github.com/anonymous/c3fc0204cdf763d10cdce1b569211a99

arcanis commented on 2017-03-21 09:11

could you please provide full build log (pastebin/whatever)?

LadyOutlaw commented on 2017-03-20 21:22

Im stuck in this loop



Generating moc compilation tomahawklib_automoc.cpp
moc failed...
make[2]: *** [src/libtomahawk/CMakeFiles/tomahawklib_automoc.dir/build.make:58: src/libtomahawk/CMakeFiles/tomahawklib_automoc] Error 1
make[1]: *** [CMakeFiles/Makefile2:563: src/libtomahawk/CMakeFiles/tomahawklib_automoc.dir/all] Error 2
make: *** [Makefile:161: all] Error 2
==> ERROR: A failure occurred in build().
Aborting...
==> ERROR: Makepkg was unable to build tomahawk.
==> Restart building tomahawk ? [y/N]