Package Details: transmission-sequential-cli 3.00-4

Git Clone URL: https://aur.archlinux.org/transmission-sequential.git (read-only, click to copy)
Package Base: transmission-sequential
Description: Fast, easy, and free BitTorrent client (CLI tools, daemon and web client) (+sequential patch)
Upstream URL: http://www.transmissionbt.com/
Keywords: torrent
Licenses: MIT
Conflicts: transmission-cli
Provides: transmission-cli
Submitter: Mikaye
Maintainer: gbc921
Last Packager: gbc921
Votes: 18
Popularity: 0.020508
First Submitted: 2014-07-30 14:57 (UTC)
Last Updated: 2022-03-12 10:32 (UTC)

Required by (46)

Sources (5)

Latest Comments

1 2 3 4 Next › Last »

agusdallalba commented on 2022-12-21 22:22 (UTC) (edited on 2022-12-21 22:22 (UTC) by agusdallalba)

Transmission is crashing a few seconds after starting after an openssl upgrade.

Please add this patch to the package: https://github.com/archlinux/svntogit-packages/commit/936dc93773fc4e84227fa902b1222ace9c5d170c

ratata commented on 2022-07-29 18:12 (UTC)

You should add miniupnpc as a dependency.

gbc921 commented on 2022-03-12 10:33 (UTC)

Hi @luntik2012, I just adopted this package and it is building for me. Does it work for you too?

whoami commented on 2022-03-11 11:25 (UTC)

Oh, wow. I forgot that I have Artix and its repositories contain transmission-sequential. So I'll drop it too.

luntik2012 commented on 2022-03-09 16:48 (UTC)

i'll just repeat that, package is not valid and should be fixed

In file included from /usr/include/gtk-3.0/gtk/gtkdialog.h:32,
                 from /usr/include/gtk-3.0/gtk/gtkaboutdialog.h:30,
                 from /usr/include/gtk-3.0/gtk/gtk.h:31,
                 from details.c:14:
/usr/include/gtk-3.0/gtk/gtkwindow.h:427:52: note: expected ‘GtkWindow *’ {aka ‘struct _GtkWindow *’} but argument is of type ‘GtkWidget *’ {aka ‘struct _GtkWidget *’}
  427 | void     gtk_window_resize           (GtkWindow   *window,
      |                                       ~~~~~~~~~~~~~^~~~~~
main.c: In function ‘main’:
main.c:641:71: error: ‘GETTEXT_PACKAGE’ undeclared (first use in this function)
  641 |     g_option_context_add_main_entries(option_context, option_entries, GETTEXT_PACKAGE);
      |                                                                       ^~~~~~~~~~~~~~~
main.c:641:71: note: each undeclared identifier is reported only once for each function it appears in
main.c: In function ‘app_setup’:
main.c:748:9: warning: ‘GtkStock’ is deprecated [-Wdeprecated-declarations]
  748 |         gtk_dialog_add_button(GTK_DIALOG(w), GTK_STOCK_CANCEL, GTK_RESPONSE_REJECT);
      |         ^~~~~~~~~~~~~~~~~~~~~
main.c: In function ‘on_app_exit’:
main.c:976:5: warning: ‘GtkStock’ is deprecated [-Wdeprecated-declarations]
  976 |     w = gtk_image_new_from_icon_name(GTK_STOCK_NETWORK, GTK_ICON_SIZE_DIALOG);
      |     ^
make[3]: *** [Makefile:712: main.o] Error 1

whoami commented on 2021-10-20 16:44 (UTC)

@Deewiant, thanks, looks like it works

Deewiant commented on 2021-10-20 14:32 (UTC)

The GETTEXT_PACKAGE build error mentioned by whoami can be fixed by removing the # from these three lines in transmission_autoconf.patch:

+#    GETTEXT_PACKAGE=transmission-gtk
+#    AC_SUBST(GETTEXT_PACKAGE)
+#    AC_DEFINE_UNQUOTED([GETTEXT_PACKAGE],["$GETTEXT_PACKAGE"],[Gettext package])

I'm not sure how appropriate this is given the rest of the patch, but at least it builds.

whoami commented on 2021-10-05 00:40 (UTC)

main.c: In function ‘main’:
main.c:641:71: error: ‘GETTEXT_PACKAGE’ undeclared (first use in this function)
  641 |     g_option_context_add_main_entries(option_context, option_entries, GETTEXT_PACKAGE);
      |                                                                       ^~~~~~~~~~~~~~~
main.c:641:71: note: each undeclared identifier is reported only once for each function it appears in
main.c: In function ‘app_setup’:
main.c:748:9: warning: ‘GtkStock’ is deprecated [-Wdeprecated-declarations]
  748 |         gtk_dialog_add_button(GTK_DIALOG(w), GTK_STOCK_CANCEL, GTK_RESPONSE_REJECT);
      |         ^~~~~~~~~~~~~~~~~~~~~
main.c: In function ‘on_app_exit’:
main.c:976:5: warning: ‘GtkStock’ is deprecated [-Wdeprecated-declarations]
  976 |     w = gtk_image_new_from_icon_name(GTK_STOCK_NETWORK, GTK_ICON_SIZE_DIALOG);
      |     ^
make[3]: *** [Makefile:711: main.o] Error 1
make[3]: Leaving directory '/home/user/build/transmission-sequential/src/transmission-3.00-seq1/gtk'
make[2]: *** [Makefile:850: all-recursive] Error 1
make[2]: Leaving directory '/home/user/build/transmission-sequential/src/transmission-3.00-seq1/gtk'
make[1]: *** [Makefile:587: all] Error 2
make[1]: Leaving directory '/home/user/build/transmission-sequential/src/transmission-3.00-seq1/gtk'
make: *** [Makefile:492: all-recursive] Error 1
==> ERROR: A failure occurred in build().
    Aborting...