Package Details: v4l-dvb-git r660.a9c762b-3

Git Clone URL: (read-only, click to copy)
Package Base: v4l-dvb-git
Description: V4L-DVB device drivers
Upstream URL:
Licenses: GPL
Submitter: hydro
Maintainer: None
Last Packager: hydro
Votes: 6
Popularity: 0.000022
First Submitted: 2015-08-22 17:37
Last Updated: 2016-04-17 20:55

Latest Comments

1 2 Next › Last »

albacore commented on 2020-12-20 20:11

Fails to build on my machine with this message:

v4l-dvb-git/src/media_build/v4l/../linux/include/linux/dma-buf.h:16:10: fatal error: linux/dma-buf-map.h: No such file or directory


rafalfr commented on 2020-05-13 21:10

Cannot build the package. I get the error message

ERROR: "fwnode_get_name" [/var/tmp/pamac-build-rafal/v4l-dvb-git/src/media_build/v4l/v4l2-fwnode.ko] undefined!

kz0 commented on 2016-11-25 14:52

Compiled on arm using kirkwood-headers but getting an error upon install:

make[1]: *** No rule to make target 'mm-install', needed by 'install'. Stop.

hydro commented on 2016-06-27 21:45

You have to install the kernel header package that matches the kernel you are running. I am not familiar with Manjaro, but I suspect you need the package linux44-headers.

yesman commented on 2016-06-27 18:14

hi hydro
Thanks , i have done "manuell" installation...
now it failt :
Preparing to compile for kernel version 4.4.13
File not found: /lib/modules/4.4.13-1-MANJARO/build/.config at ./scripts/ line 33, <IN> line 4.
Updating/Creating .config
make[2]: Entering directory '/home/frank/Downloads/v4l-dvb-git/src/media_build/linux'
Patches for 4.4.13-1-MANJARO already applied.
make[2]: Leaving directory '/home/frank/Downloads/v4l-dvb-git/src/media_build/linux'
Preparing to compile for kernel version 4.4.13
File not found: /lib/modules/4.4.13-1-MANJARO/build/.config at ./scripts/ line 33, <IN> line 4.
make[1]: *** Keine Regel vorhanden, um das Ziel „.config“,
benötigt von „.myconfig“, zu erstellen. Schluss.
make[1]: Verzeichnis „/home/frank/Downloads/v4l-dvb-git/src/media_build/v4l“ wird verlassen
make: *** [Makefile:26: all] Fehler 2
==> FEHLER: Ein Fehler geschah in build().
Breche ab...
sorry my english,i am german

hydro commented on 2016-06-21 05:48

@yesman: The AUR helper program you decided to use by default extracts sources to (and also builds them on) /tmp, which is by default configured to store it's content inside the computer's RAM, which obviously does not suffice the size required to build this package. Tell your AUR helper program to use a different directory. Or follow the official guide to install packages from source:

yesman commented on 2016-06-20 12:13

installation failed:

LD [M] /tmp/yaourt-tmp-frank/aur-v4l-dvb-git/src/media_build/v4l/dvb-core.ko
ld: final link failed: No space left on device
scripts/Makefile.modpost:125: die Regel für Ziel „/tmp/yaourt-tmp-frank/aur-v4l-dvb-git/src/media_build/v4l/dvb-core.ko“ scheiterte
make[3]: *** [/tmp/yaourt-tmp-frank/aur-v4l-dvb-git/src/media_build/v4l/dvb-core.ko] Fehler 1
Makefile:1388: recipe for target 'modules' failed
make[2]: *** [modules] Error 2
make[2]: Leaving directory '/usr/lib/modules/4.4.13-1-MANJARO/build'
Makefile:51: die Regel für Ziel „default“ scheiterte
make[1]: *** [default] Fehler 2
make[1]: Verzeichnis „/tmp/yaourt-tmp-frank/aur-v4l-dvb-git/src/media_build/v4l“ wird verlassen
Makefile:26: die Regel für Ziel „all“ scheiterte
make: *** [all] Fehler 2
==> FEHLER: Ein Fehler geschah in build().
Breche ab...
==> FEHLER:Makepkg konnte v4l-dvb-git nicht erstellen.
==> Erstellen von v4l-dvb-git neu starten?[j/N]

hydro commented on 2016-05-11 06:12

Just built and installed without problems.
This package is much affected by temporary upstream issues.

Kresimir commented on 2016-05-10 11:12

"makepkg" doesn't work, it stops very early, lines 73 and 74 of the downloaded file src/media_build/linux/Makefile define URLs starting with "http:" instead of "https:", which leads to a '404 - not found' error.

I tried to update manually and build using "makepkg -e", but this only lead to a failure to build at a later stage.

How can this issue be overcome, how can I contribute to fix this?

Martchus commented on 2016-04-17 18:30

I think the make dependency kmod is missing.

./scripts/ check
Can't find needed utility 'modinfo' at ./scripts/ line 51.
Makefile:51: recipe for target 'default' failed