Package Details: vapoursynth-plugin-bm3d-git r8.0.g7b3d8dd-1

Git Clone URL: https://aur.archlinux.org/vapoursynth-plugin-bm3d-git.git (read-only, click to copy)
Package Base: vapoursynth-plugin-bm3d-git
Description: Plugin for Vapoursynth: bm3d (GIT version)
Upstream URL: https://forum.doom9.org/showthread.php?t=172172
Keywords: vapoursynth
Licenses: MIT
Conflicts: vapoursynth-plugin-bm3d
Provides: vapoursynth-plugin-bm3d
Submitter: sl1pkn07
Maintainer: sl1pkn07
Last Packager: sl1pkn07
Votes: 5
Popularity: 0.000000
First Submitted: 2015-05-24 11:13
Last Updated: 2021-06-09 20:33

Latest Comments

jholmer commented on 2021-06-10 06:35

Thanks, build seems fixed now.

sl1pkn07 commented on 2021-06-09 20:33

try now

jholmer commented on 2021-06-09 20:28

+1 on the build failure, have been experiencing this for a few days. Odd because the vaopursynth-bm3d repo hasn't changed in 2 years.

dd86 commented on 2021-06-02 14:18

This fails to build with the following error:

[7/10] Compiling C++ object libbm3d.so.p/source_VBM3D_Final.cpp.o
FAILED: libbm3d.so.p/source_VBM3D_Final.cpp.o 
c++ -Ilibbm3d.so.p -I. -I../bm3d -I../bm3d/include -I/usr/include/vapoursynth -fvisibility=hidden -flto=auto -fdiagnostics-color=always -DNDEBUG -D_FILE_OFFSET_BITS=64 -Wall -Winvalid-pch -Wnon-virtual-dtor -std=c++14 -Wno-unused-local-typedefs -mfpmath=sse -msse2 -march=x86-64 -mtune=generic -O2 -pipe -fno-plt -fexceptions -Wp,-D_FORTIFY_SOURCE=2 -Wformat -Werror=format-security -fstack-clash-protection -fcf-protection -Wp,-D_GLIBCXX_ASSERTIONS -fPIC -MD -MQ libbm3d.so.p/source_VBM3D_Final.cpp.o -MF libbm3d.so.p/source_VBM3D_Final.cpp.o.d -o libbm3d.so.p/source_VBM3D_Final.cpp.o -c ../bm3d/source/VBM3D_Final.cpp
../bm3d/source/VBM3D_Final.cpp: In member function ‘virtual void VBM3D_Final_Process::CollaborativeFilter(int, const std::vector<float*>&, const std::vector<float*>&, const std::vector<const float*>&, const std::vector<const float*>&, const Pos3PairCode&) const’:
../bm3d/source/VBM3D_Final.cpp:119:25: error: ‘numeric_limits’ is not a member of ‘std’
  119 |     L2Wiener = Max(std::numeric_limits<float>::epsilon(), L2Wiener);
      |                         ^~~~~~~~~~~~~~
../bm3d/source/VBM3D_Final.cpp:119:40: error: expected primary-expression before ‘float’
  119 |     L2Wiener = Max(std::numeric_limits<float>::epsilon(), L2Wiener);
      |                                        ^~~~~
[9/10] Compiling C++ object libbm3d.so.p/source_VSPlugin.cpp.o
ninja: build stopped: subcommand failed.
==> ERROR: A failure occurred in build().
    Aborting...
error: failed to build 'vapoursynth-plugin-bm3d-git-r8.0.g7b3d8dd-1': 
:: Packages failed to build: vapoursynth-plugin-bm3d-git-r8.0.g7b3d8dd-1

sl1pkn07 commented on 2019-01-25 22:24

done

gardar commented on 2019-01-16 02:09

Updated PKGBUILD: https://gist.github.com/gardar/b72af9d0aa7dc0c13b3f6bba505cfe63