Package Details: vcvrack-git 0.5.0.r2.ga17ae2c-1

Git Clone URL: (read-only)
Package Base: vcvrack-git
Description: Open-source virtual Eurorack DAW
Upstream URL:
Licenses: BSD
Submitter: mkoskar
Maintainer: mkoskar
Last Packager: mkoskar
Votes: 5
Popularity: 1.463754
First Submitted: 2017-09-19 17:33
Last Updated: 2017-11-25 23:38

Latest Comments

mkoskar commented on 2017-11-25 23:48

Should be all good now @silence. Thanks for reporting. FYI. I've added vcvrack-vult-git and vcvrack-mental-git packages.

silence commented on 2017-11-25 23:13

Compilation is still failing unfortuately.

It finds RtAudio.h now, but:

src/util.cpp:1:10: fatal error: util.hpp: No such file or directory
#include "util.hpp"
compilation terminated.
make: *** [ build/src/util.cpp.o] Error 1

jonathon commented on 2017-11-23 18:42

Compilation failing... :(

src/core/AudioInterface.cpp:11:10: fatal error: RtAudio.h: No such file or directory
#include <RtAudio.h>
compilation terminated.

Edit: Upstream issue:


Also, the vcvrack Makefile has a lot of static dependencies - not sure if these could be trimmed in preference to Arch sources?

mkoskar commented on 2017-11-21 17:53

Thanks for notifying me @UlrichH. I've done that, and also moved to tagged versioning now that it's available.

UlrichH commented on 2017-11-19 10:46

They went from portaudio to rtaudio

mkoskar commented on 2017-10-08 06:24

You're right mongrol, thanks for reporting it! It seems to be due "Update makefiles to include rtmidi and remove portmidi" <>.

mongrol commented on 2017-10-08 01:31

Fails on not finding rtmidi.h. Had to install "rtmidi" from AUR to fix build.