Package Details: vigra-git 3863.e360aa3-1

Git Clone URL: https://aur.archlinux.org/vigra-git.git (read-only)
Package Base: vigra-git
Description: Computer vision library
Upstream URL: http://hci.iwr.uni-heidelberg.de/vigra/
Licenses: custom:MIT
Conflicts: vigra, vigra-hg
Provides: vigra, vigra-hg
Replaces: vigra-hg
Submitter: stativ
Maintainer: stativ
Last Packager: stativ
Votes: 0
Popularity: 0.000000
First Submitted: 2011-09-18 17:14
Last Updated: 2015-06-29 20:02

Dependencies (14)

Required by (3)

Sources (1)

Latest Comments

stativ commented on 2014-05-12 18:36

This is "only" a test suite failure. For now I have changed the PKGBUILD to ignore test suite failures. Anyway, it may be a good idea to contact upstream about the failing test.

geosam commented on 2014-05-09 16:11

I get the next errors:

[ 39%] Building CXX object vigranumpy/test/CMakeFiles/vigranumpytest.dir/testsuccess.cxx.o
Linking CXX shared library vigranumpytest.so
Running vigranumpy tests
Running vigranumpy tests
Running vigranumpy tests
Running vigranumpy tests
Running vigranumpy tests
Running vigranumpy tests
Running vigranumpy tests

executing test file /tmp/packerbuild-0/vigra-git/vigra-git/src/vigra/vigranumpy/test/test1.py
./run_vigranumpytest.sh: línea 1: 19512 Violación de segmento (`core' generado) /usr/bin/python2 -c "import nose; nose.main()" .
vigranumpy/test/CMakeFiles/vigranumpytest.dir/build.make:136: recipe for target 'vigranumpy/test/vigranumpytest.so' failed
make[3]: *** [vigranumpy/test/vigranumpytest.so] Error 1
CMakeFiles/Makefile2:3471: recipe for target 'vigranumpy/test/CMakeFiles/vigranumpytest.dir/all' failed
make[2]: *** [vigranumpy/test/CMakeFiles/vigranumpytest.dir/all] Error 2
CMakeFiles/Makefile2:104: recipe for target 'CMakeFiles/check.dir/rule' failed
make[1]: *** [CMakeFiles/check.dir/rule] Error 2
Makefile:193: recipe for target 'check' failed
make: *** [check] Error 2
==> ERROR: Se produjo un error en check().
Cancelando...
The build failed.

stativ commented on 2013-04-30 17:57

Update for the pacman 4.1