Package Details: virtuoso 7.2.4.2-2

Git Clone URL: https://aur.archlinux.org/virtuoso.git (read-only)
Package Base: virtuoso
Description: Virtuoso is a scalable cross-platform server that combines Relational,\ Graph, and Document Data Management with Web Application Server and Web \ Services Platform functionality.
Upstream URL: http://virtuoso.openlinksw.com/wiki/main/Main/
Licenses: GPL
Provides: virtuoso-base
Replaces: virtuoso-base
Submitter: jose1711
Maintainer: jose1711
Last Packager: jose1711
Votes: 1
Popularity: 0.000012
First Submitted: 2015-12-17 19:03
Last Updated: 2017-08-19 23:04

Latest Comments

jose1711 commented on 2017-08-19 23:06

@vstuart please, try an update

vstuart commented on 2017-08-16 03:07

Aug 15, 2017 | Arch Linux x86_64

$ pacaur -S virtuoso
...
AUR Packages (1) virtuoso-7.2.4.2-1
Repo Packages (2) gperf-3.1-1 net-tools-1.60.20160710git-1

Repo Download Size: 0.21 MiB
Repo Installed Size: 0.68 MiB

:: Proceed with installation? [Y/n]
...
make[3]: *** [Makefile:1289: libwi_la-bif_crypto.lo] Error 1
make[3]: Leaving directory '/home/victoria/.cache/pacaur/virtuoso/src/virtuoso-opensource-7.2.4.2/libsrc/Wi'
make[2]: *** [Makefile:951: all] Error 2
make[2]: Leaving directory '/home/victoria/.cache/pacaur/virtuoso/src/virtuoso-opensource-7.2.4.2/libsrc/Wi'
make[1]: *** [Makefile:464: all-recursive] Error 1
make[1]: Leaving directory '/home/victoria/.cache/pacaur/virtuoso/src/virtuoso-opensource-7.2.4.2/libsrc'
make: *** [Makefile:619: all-recursive] Error 1

==> ERROR: A failure occurred in build().
Aborting...
:: gperf is now an orphan package
:: net-tools is now an orphan package
:: failed to build virtuoso package(s)

$

# ==================================================

$ pacaur -S virtuoso6
:: Package virtuoso6 not found in repositories, trying AUR...
:: resolving dependencies...
:: looking for inter-conflicts...

AUR Packages (1) virtuoso6-6.1.8-1

:: Proceed with installation? [Y/n]
...
==> ERROR: virtuoso6 is not available for the 'x86_64' architecture.

==> ERROR: An unknown error has occurred. Exiting...
:: failed to verify virtuoso6 integrity

$

edwardsgary commented on 2016-04-14 16:08

Hi, thanks for this package. I found that I could not build this without the cpio package. Should this be added to the dependencies?