Package Details: vlc-decklink 3.0.7.1-1

Git Clone URL: https://aur.archlinux.org/vlc-decklink.git (read-only, click to copy)
Package Base: vlc-decklink
Description: Multi-platform MPEG, VCD/DVD, and DivX player (with decklink support)
Upstream URL: https://www.videolan.org/vlc/
Licenses: GPL2, LGPL2.1
Conflicts: vlc, vlc-plugin
Provides: vlc
Replaces: vlc-plugin
Submitter: alub
Maintainer: None
Last Packager: dbermond
Votes: 2
Popularity: 0.000000
First Submitted: 2012-02-26 18:28
Last Updated: 2019-06-17 17:18

Dependencies (153)

Required by (141)

Sources (4)

Latest Comments

1 2 Next › Last »

ericfont commented on 2021-04-12 22:20

In file included from access/srt.c:38: /usr/include/srt/srt.h:754:41: note: declared here 754 | SRT_ATR_DEPRECATED_PX SRT_API SRTSOCKET srt_socket(int, int, int) SRT_ATR_DEPRECATED; | ^~~~~~~~~~ access/srt.c:168:37: error: ‘SRTO_TSBPDDELAY’ undeclared (first use in this function); did you mean ‘SRTO_TSBPDMODE’? 168 | srt_setsockopt( p_sys->sock, 0, SRTO_TSBPDDELAY, | ^~~~~~~~~~~~~~~ | SRTO_TSBPDMODE

ericfont commented on 2021-04-02 02:47

Got the following build error:

In file included from access/srt.c:38: /usr/include/srt/srt.h:754:41: note: declared here 754 | SRT_ATR_DEPRECATED_PX SRT_API SRTSOCKET srt_socket(int, int, int) SRT_ATR_DEPRECATED; | ^~~~~~~~~~ access/srt.c:168:37: error: ‘SRTO_TSBPDDELAY’ undeclared (first use in this function); did you mean ‘SRTO_TSBPDMODE’? 168 | srt_setsockopt( p_sys->sock, 0, SRTO_TSBPDDELAY, | ^~~~~~~~~~~~~~~ | SRTO_TSBPDMODE

Wolli commented on 2019-01-15 18:58

Hi, sorry for the german text. Here is the english version:

                            double(timescale) / frameduration,
                             ~~~~~~~~~~~~~~~~~~~~~~~~~~~~~~~~~

../include/vlc_messages.h:79:23: note: in definition of macro ‘msg_Generic’ func, VA_ARGS) ^~~~~~~~~~~ video_output/decklink.cpp:496:25: note: in expansion of macro ‘msg_Dbg’ msg_Dbg(vd, "Found mode '%4.4s': %s (%ldx%ld, %.3f fps, %4.4s, scale %ld dur %ld)", ^~~~~~~ In function ‘decklink_sys_t HoldDLSys(vlc_object_t, int)’: cc1plus: warning: call to ‘harmful_delay’ declared with attribute warning: use proper event handling instead of short delay CXXLD libdecklinkoutput_plugin.la CC video_output/opengl/libgl_plugin_la-vout_helper.lo video_output/opengl/vout_helper.c: In function ‘opengl_init_program’: video_output/opengl/vout_helper.c:631:25: error: too many arguments to function ‘pl_shader_alloc’ tc->pl_sh = pl_shader_alloc(tc->pl_ctx, NULL, 0, 0); ^~~~~~~~~~~~~~~ In file included from /usr/include/libplacebo/shaders/colorspace.h:27, from video_output/opengl/vout_helper.h:35, from video_output/opengl/vout_helper.c:44: /usr/include/libplacebo/shaders.h:46:19: note: declared here struct pl_shader pl_shader_alloc(struct pl_context ctx, ^~~~~~~~~~~~~~~ make[4]: [Makefile:21715: video_output/opengl/libgl_plugin_la-vout_helper.lo] Error 1 make[4]: Leaving directory '/var/tmp/pamac-build-wolfgang/vlc-decklink/src/vlc-3.0.4/modules' make[3]: [Makefile:27359: all-recursive] Error 1 make[3]: Leaving directory '/var/tmp/pamac-build-wolfgang/vlc-decklink/src/vlc-3.0.4/modules' make[2]: [Makefile:12457: all] Error 2 make[2]: Leaving directory '/var/tmp/pamac-build-wolfgang/vlc-decklink/src/vlc-3.0.4/modules' make[1]: [Makefile:1533: all-recursive] Error 1 make[1]: Leaving directory '/var/tmp/pamac-build-wolfgang/vlc-decklink/src/vlc-3.0.4' make: *** [Makefile:1418: all] Error 2 ==> ERROR: A failure occurred in build().

Regards Wolfgang

Wolli commented on 2019-01-15 17:09

i tied to install this package in the latest ARCH-Version and got the following ERROR-Message:

video_output/decklink.cpp:500:33: double(timescale) / frameduration, ~~~~~~~~~~~~~~~~~~~~~~~~~~~~~~~~~ ../include/vlc_messages.h:79:23: Anmerkung: in Definition des Makros »msg_Generic« func, VA_ARGS) ^~~~~~~~~~~ video_output/decklink.cpp:496:25: Anmerkung: bei Substitution des Makros »msg_Dbg« msg_Dbg(vd, "Found mode '%4.4s': %s (%ldx%ld, %.3f fps, %4.4s, scale %ld dur %ld)", ^~~~~~~ In Funktion »decklink_sys_t HoldDLSys(vlc_object_t, int)«: cc1plus: Warnung: Aufruf von »harmful_delay« mit Attributwarnung deklariert: use proper event handling instead of short delay CXXLD libdecklinkoutput_plugin.la CC video_output/opengl/libgl_plugin_la-vout_helper.lo video_output/opengl/vout_helper.c: In Funktion »opengl_init_program«: video_output/opengl/vout_helper.c:631:25: Fehler: zu viele Argumente für Funktion »pl_shader_alloc« tc->pl_sh = pl_shader_alloc(tc->pl_ctx, NULL, 0, 0); ^~~~~~~~~~~~~~~ In file included from /usr/include/libplacebo/shaders/colorspace.h:27, from video_output/opengl/vout_helper.h:35, from video_output/opengl/vout_helper.c:44: /usr/include/libplacebo/shaders.h:46:19: Anmerkung: hier deklariert struct pl_shader pl_shader_alloc(struct pl_context ctx, ^~~~~~~~~~~~~~~ make[4]: [Makefile:21715: video_output/opengl/libgl_plugin_la-vout_helper.lo] Fehler 1 make[4]: Verzeichnis „/var/tmp/pamac-build-wolfgang/vlc-decklink/src/vlc-3.0.4/modules“ wird verlassen make[3]: [Makefile:27359: all-recursive] Fehler 1 make[3]: Verzeichnis „/var/tmp/pamac-build-wolfgang/vlc-decklink/src/vlc-3.0.4/modules“ wird verlassen make[2]: [Makefile:12457: all] Fehler 2 make[2]: Verzeichnis „/var/tmp/pamac-build-wolfgang/vlc-decklink/src/vlc-3.0.4/modules“ wird verlassen make[1]: [Makefile:1533: all-recursive] Fehler 1 make[1]: Verzeichnis „/var/tmp/pamac-build-wolfgang/vlc-decklink/src/vlc-3.0.4“ wird verlassen make: *** [Makefile:1418: all] Fehler 2 ==> FEHLER: Ein Fehler geschah in build(). Breche ab...

Please can You tell me the reason for this. Thank You and regards Wolfgang

lonaowna commented on 2018-02-28 15:46

Kakashi-sensei: https://wiki.archlinux.org/index.php/DeveloperWiki:Building_in_a_Clean_Chroot

Kakashi-sensei commented on 2018-02-02 06:34

I have never heard of the term, "clean chroot". It sounds like an oxymoron.

dbermond commented on 2018-01-27 22:59

@Kakashi-sensei It's working fine here. Videos are playing normally for me.

Please try to build it in a clean chroot.

Kakashi-sensei commented on 2018-01-27 12:30

VLC media player 2.2.8 Weatherwax (revision 2.2.7-14-g3cc1d8cba9) Inconsistency detected by ld.so: ../elf/dl-tls.c: 74: _dl_next_tls_modid: Assertion `result <= GL(dl_tls_max_dtv_idx) + 1' failed!

Kakashi-sensei commented on 2018-01-25 16:17

Thanks!

dbermond commented on 2018-01-25 14:15

@Kakashi-sensei Package is updated and now building fine.

Thank you for the interest.