Package Details: vtk-qt4 7.1.1-1

Git Clone URL: https://aur.archlinux.org/vtk-qt4.git (read-only)
Package Base: vtk-qt4
Description: A software system for 3D computer graphics, image processing, and visualization. Linked against QT4
Upstream URL: http://www.vtk.org/
Keywords: graphics image Processing visualization
Licenses: BSD
Submitter: saxonbeta
Maintainer: None
Last Packager: saxonbeta
Votes: 3
Popularity: 0.002159
First Submitted: 2015-10-28 20:05
Last Updated: 2017-05-29 23:39

Dependencies (39)

Sources (3)

Latest Comments

KokPok commented on 2017-06-13 10:18

Doesn't compile

[quote][2661/23680] Building C object ThirdParty/hdf5/vtkhdf5/src/CMakeFiles/vtkhdf5.dir/H5Faccum.c.o
[2662/23680] Building C object ThirdParty/hdf5/vtkhdf5/src/CMakeFiles/vtkhdf5.dir/H5Fefc.c.o
FAILED: ThirdParty/hdf5/vtkhdf5/src/CMakeFiles/vtkhdf5.dir/H5Fefc.c.o
/usr/lib/hardening-wrapper/bin/cc -DNDEBUG -DVTK_IN_VTK -D_BSD_SOURCE -D_DEFAULT_SOURCE -D_FILE_OFFSET_BITS=64 -D_LARGEFILE64_SOURCE -D_LARGEFILE_SOURCE -Dhdf5_EXPORTS -IThirdParty/hdf5/vtkhdf5 -I/tmp/pamac-build-kostia/vtk-qt4/src/VTK-7.1.1/ThirdParty/hdf5/vtkhdf5/hl/src -I/tmp/pamac-build-kostia/vtk-qt4/src/VTK-7.1.1/ThirdParty/hdf5/vtkhdf5/src -IThirdParty/hdf5 -I/tmp/pamac-build-kostia/vtk-qt4/src/VTK-7.1.1/ThirdParty/hdf5 -IThirdParty/zlib -I/tmp/pamac-build-kostia/vtk-qt4/src/VTK-7.1.1/ThirdParty/zlib -Ibin -I/tmp/pamac-build-kostia/vtk-qt4/src/VTK-7.1.1/ThirdParty/hdf5/vtkhdf5 -I. -march=x86-64 -mtune=generic -O2 -pipe -fstack-protector-strong -w -w -std=c99 -fomit-frame-pointer -finline-functions -fno-common -w -Wextra -Wundef -Wshadow -Wpointer-arith -Wbad-function-cast -Wcast-qual -Wcast-align -Wwrite-strings -Wconversion -Waggregate-return -Wstrict-prototypes -Wmissing-prototypes -Wmissing-declarations -Wredundant-decls -Wnested-externs -Winline -fmessage-length=0 -O3 -DNDEBUG -fPIC -MD -MT ThirdParty/hdf5/vtkhdf5/src/CMakeFiles/vtkhdf5.dir/H5Fefc.c.o -MF ThirdParty/hdf5/vtkhdf5/src/CMakeFiles/vtkhdf5.dir/H5Fefc.c.o.d -o ThirdParty/hdf5/vtkhdf5/src/CMakeFiles/vtkhdf5.dir/H5Fefc.c.o -c /tmp/pamac-build-kostia/vtk-qt4/src/VTK-7.1.1/ThirdParty/hdf5/vtkhdf5/src/H5Fefc.c
/tmp/pamac-build-kostia/vtk-qt4/src/VTK-7.1.1/ThirdParty/hdf5/vtkhdf5/src/H5Fefc.c:950:1: внутренняя ошибка компилятора: в pop_scope, в c/c-decl.c:1352
} /* end H5F_efc_try_close() */
^
Please submit a full bug report,
with preprocessed source if appropriate.
See <https://bugs.archlinux.org/> for instructions.
[2663/23680] Building C object ThirdParty/hdf5/vtkhdf5/src/CMakeFiles/vtkhdf5.dir/H5Fio.c.o
[2664/23680] Building C object ThirdParty/hdf5/vtkhdf5/src/CMakeFiles/vtkhdf5.dir/H5Fmount.c.o
[2665/23680] Building C object ThirdParty/hdf5/vtkhdf5/src/CMakeFiles/vtkhdf5.dir/H5F.c.o
[2666/23680] Building C object ThirdParty/hdf5/vtkhdf5/src/CMakeFiles/vtkhdf5.dir/H5E.c.o
[2667/23680] Building C object ThirdParty/glew/vtkglew/CMakeFiles/vtkglew.dir/src/glew.c.o
ninja: build stopped: subcommand failed.[/quote]

Kunda commented on 2017-03-15 00:30

@saxonbeta would it be possible to bump to VTK7.1 ?

metcalfe commented on 2016-10-03 17:29

@jaltonaga

I had the same issue. My default java env was set to java-8-openjdk/jre
Changing default to java 7 with 'archlinux-java set java-7-openjdk' got it to work.

TheNiceGuy commented on 2016-09-28 10:56

Doesn't compile, here the relevent log:

FAILED: bin/vtkIOGDALCxxTests
: && /usr/lib/hardening-wrapper/bin/c++ -D__STDC_CONSTANT_MACROS -O3 -DNDEBUG -Wl,--no-undefined -lc -Wl,--no-undefined -lc -Wl,-O1,--sort-common,--as-needed,-z,relro IO/GDAL/Testing/Cxx/CMakeFiles/vtkIOGDALCxxTests.dir/vtkIOGDALCxxTests.cxx.o IO/GDAL/Testing/Cxx/CMakeFiles/vtkIOGDALCxxTests.dir/TestGDALVectorReader.cxx.o IO/GDAL/Testing/Cxx/CMakeFiles/vtkIOGDALCxxTests.dir/TestGDALRasterReader.cxx.o -o bin/vtkIOGDALCxxTests -L/usr/lib64/jvm/default/jre/lib/amd64/server -rdynamic lib/libvtkIOGDAL.so.1 -lz -ljpeg -lpng -ltiff lib/libvtkInteractionStyle.so.1 lib/libvtkRenderingOpenGL2.so.1 lib/libvtkImagingHybrid.so.1 lib/libvtkglew.so.1 lib/libvtkTestingRendering.so.1 -lSM -lICE -lX11 -lXext -lXt lib/libvtkIOImage.so.1 lib/libvtkDICOMParser.so.1 lib/libvtkIOCore.so.1 lib/libvtkmetaio.so.1 -lz lib/libvtkRenderingCore.so.1 lib/libvtkFiltersExtraction.so.1 lib/libvtkFiltersStatistics.so.1 lib/libvtkImagingFourier.so.1 lib/libvtkImagingCore.so.1 lib/libvtkalglib.so.1 lib/libvtkFiltersSources.so.1 lib/libvtkFiltersGeneral.so.1 lib/libvtkCommonComputationalGeometry.so.1 lib/libvtkCommonColor.so.1 lib/libvtkFiltersGeometry.so.1 lib/libvtkFiltersCore.so.1 lib/libvtkCommonExecutionModel.so.1 lib/libvtkCommonDataModel.so.1 lib/libvtkCommonMisc.so.1 lib/libvtkCommonSystem.so.1 lib/libvtksys.so.1 -ldl lib/libvtkCommonTransforms.so.1 lib/libvtkCommonMath.so.1 lib/libvtkCommonCore.so.1 && :
/usr/bin/ld: warning: libhdf5.so.100, needed by /usr/lib/libgdal.so.20, not found (try using -rpath or -rpath-link)
/usr/bin/ld: warning: libhdf5_hl.so.100, needed by /usr/lib/libnetcdf.so.12, not found (try using -rpath or -rpath-link)
/usr/lib/libnetcdf.so.12: undefined reference to `H5Tget_member_type'
/usr/lib/libnetcdf.so.12: undefined reference to `H5P_CLS_DATASET_CREATE_ID_g'
/usr/lib/libnetcdf.so.12: undefined reference to `H5Pset_link_creation_order'
/usr/lib/libgdal.so.20: undefined reference to `H5Dread'
/usr/lib/libgdal.so.20: undefined reference to `H5Dget_create_plist'
/usr/lib/libnetcdf.so.12: undefined reference to `H5Tget_order'
/usr/lib/libgdal.so.20: undefined reference to `H5Aopen_name'
/usr/lib/libgdal.so.20: undefined reference to `H5Eset_auto2'
/usr/lib/libnetcdf.so.12: undefined reference to `H5Fcreate'
/usr/lib/libnetcdf.so.12: undefined reference to `H5Pget_chunk_cache'
/usr/lib/libnetcdf.so.12: undefined reference to `H5Aopen_idx'
/usr/lib/libnetcdf.so.12: undefined reference to `H5DSget_num_scales'
/usr/lib/libnetcdf.so.12: undefined reference to `H5Tget_nmembers'
/usr/lib/libnetcdf.so.12: undefined reference to `H5Tarray_create1'
/usr/lib/libgdal.so.20: undefined reference to `H5T_NATIVE_UCHAR_g'
/usr/lib/libgdal.so.20: undefined reference to `H5Tget_size'
/usr/lib/libgdal.so.20: undefined reference to `H5Gget_num_objs'
/usr/lib/libnetcdf.so.12: undefined reference to `H5Pset_chunk'
/usr/lib/libnetcdf.so.12: undefined reference to `H5T_IEEE_F64LE_g'
/usr/lib/libgdal.so.20: undefined reference to `H5Aget_num_attrs'
/usr/lib/libgdal.so.20: undefined reference to `H5Sselect_hyperslab'
/usr/lib/libgdal.so.20: undefined reference to `H5Pget_layout'
/usr/lib/libnetcdf.so.12: undefined reference to `H5T_STD_I16LE_g'
/usr/lib/libnetcdf.so.12: undefined reference to `H5Iinc_ref'
/usr/lib/libnetcdf.so.12: undefined reference to `H5Gunlink'
/usr/lib/libnetcdf.so.12: undefined reference to `H5P_CLS_DATASET_XFER_ID_g'
/usr/lib/libnetcdf.so.12: undefined reference to `H5Dset_extent'
/usr/lib/libgdal.so.20: undefined reference to `H5Pget_chunk'
/usr/lib/libnetcdf.so.12: undefined reference to `H5Pset_attr_creation_order'
/usr/lib/libnetcdf.so.12: undefined reference to `H5Tvlen_create'
/usr/lib/libnetcdf.so.12: undefined reference to `H5T_STD_I8LE_g'
/usr/lib/libgdal.so.20: undefined reference to `H5Dget_offset'
/usr/lib/libnetcdf.so.12: undefined reference to `H5Pset_layout'
/usr/lib/libnetcdf.so.12: undefined reference to `H5free_memory'
/usr/lib/libnetcdf.so.12: undefined reference to `H5Tinsert'
/usr/lib/libnetcdf.so.12: undefined reference to `H5T_STD_U64LE_g'
/usr/lib/libgdal.so.20: undefined reference to `H5Tis_variable_str'
/usr/lib/libgdal.so.20: undefined reference to `H5Tequal'
/usr/lib/libgdal.so.20: undefined reference to `H5check_version'
/usr/lib/libgdal.so.20: undefined reference to `H5Oopen'
/usr/lib/libnetcdf.so.12: undefined reference to `H5T_STD_U16LE_g'
/usr/lib/libnetcdf.so.12: undefined reference to `H5Pset_chunk_cache'
/usr/lib/libnetcdf.so.12: undefined reference to `H5T_STD_I64LE_g'
/usr/lib/libnetcdf.so.12: undefined reference to `H5Aopen_by_name'
/usr/lib/libgdal.so.20: undefined reference to `H5Dget_space'
/usr/lib/libnetcdf.so.12: undefined reference to `H5T_IEEE_F32LE_g'
/usr/lib/libgdal.so.20: undefined reference to `H5Aiterate1'
/usr/lib/libnetcdf.so.12: undefined reference to `H5T_STD_I16BE_g'
/usr/lib/libnetcdf.so.12: undefined reference to `H5Sget_simple_extent_npoints'
/usr/lib/libgdal.so.20: undefined reference to `H5Aget_space'
/usr/lib/libnetcdf.so.12: undefined reference to `H5T_STD_U32LE_g'
/usr/lib/libnetcdf.so.12: undefined reference to `H5T_STD_I64BE_g'
/usr/lib/libnetcdf.so.12: undefined reference to `H5Pget_filter2'
/usr/lib/libnetcdf.so.12: undefined reference to `H5P_CLS_FILE_CREATE_ID_g'
/usr/lib/libgdal.so.20: undefined reference to `H5Tclose'
/usr/lib/libnetcdf.so.12: undefined reference to `H5Gget_create_plist'
/usr/lib/libnetcdf.so.12: undefined reference to `H5T_IEEE_F32BE_g'
/usr/lib/libgdal.so.20: undefined reference to `H5Fis_hdf5'
/usr/lib/libnetcdf.so.12: undefined reference to `H5Dopen2'
/usr/lib/libnetcdf.so.12: undefined reference to `H5Pget_link_creation_order'
/usr/lib/libgdal.so.20: undefined reference to `H5Dget_type'
/usr/lib/libnetcdf.so.12: undefined reference to `H5P_CLS_GROUP_CREATE_ID_g'
/usr/lib/libnetcdf.so.12: undefined reference to `H5Pset_shuffle'
/usr/lib/libnetcdf.so.12: undefined reference to `H5P_CLS_FILE_ACCESS_ID_g'
/usr/lib/libgdal.so.20: undefined reference to `H5open'
/usr/lib/libgdal.so.20: undefined reference to `H5Dvlen_reclaim'
/usr/lib/libgdal.so.20: undefined reference to `H5T_NATIVE_FLOAT_g'
/usr/lib/libnetcdf.so.12: undefined reference to `H5Aget_name'
/usr/lib/libnetcdf.so.12: undefined reference to `H5Dcreate1'
/usr/lib/libnetcdf.so.12: undefined reference to `H5T_STD_U16BE_g'
/usr/lib/libgdal.so.20: undefined reference to `H5Pget_nfilters'
/usr/lib/libnetcdf.so.12: undefined reference to `H5DSset_scale'
/usr/lib/libnetcdf.so.12: undefined reference to `H5Idec_ref'
/usr/lib/libnetcdf.so.12: undefined reference to `H5Gopen2'
/usr/lib/libgdal.so.20: undefined reference to `H5T_NATIVE_USHORT_g'
/usr/lib/libnetcdf.so.12: undefined reference to `H5Pcreate'
/usr/lib/libnetcdf.so.12: undefined reference to `H5T_IEEE_F64BE_g'
/usr/lib/libgdal.so.20: undefined reference to `H5Eget_auto2'
/usr/lib/libnetcdf.so.12: undefined reference to `H5Pfill_value_defined'
/usr/lib/libnetcdf.so.12: undefined reference to `H5T_STD_I32BE_g'
/usr/lib/libnetcdf.so.12: undefined reference to `H5T_STD_U8LE_g'
/usr/lib/libnetcdf.so.12: undefined reference to `H5Acreate1'
/usr/lib/libgdal.so.20: undefined reference to `H5Aclose'
/usr/lib/libnetcdf.so.12: undefined reference to `H5T_STD_I32LE_g'
/usr/lib/libnetcdf.so.12: undefined reference to `H5T_STD_U32BE_g'
/usr/lib/libnetcdf.so.12: undefined reference to `H5Tset_size'
/usr/lib/libnetcdf.so.12: undefined reference to `H5Fget_obj_count'
/usr/lib/libgdal.so.20: undefined reference to `H5Aget_storage_size'
/usr/lib/libgdal.so.20: undefined reference to `H5T_NATIVE_ULONG_g'
/usr/lib/libnetcdf.so.12: undefined reference to `H5DSget_scale_name'
/usr/lib/libgdal.so.20: undefined reference to `H5Pget_filter1'
/usr/lib/libnetcdf.so.12: undefined reference to `H5Pset_fapl_core'
/usr/lib/libgdal.so.20: undefined reference to `H5Pclose'
/usr/lib/libnetcdf.so.12: undefined reference to `H5Pset_cache'
/usr/lib/libnetcdf.so.12: undefined reference to `H5Tget_member_name'
/usr/lib/libgdal.so.20: undefined reference to `H5Screate_simple'
/usr/lib/libgdal.so.20: undefined reference to `H5Sget_simple_extent_ndims'
/usr/lib/libgdal.so.20: undefined reference to `H5Aget_type'
/usr/lib/libgdal.so.20: undefined reference to `H5T_NATIVE_SCHAR_g'
/usr/lib/libnetcdf.so.12: undefined reference to `H5Pset_fclose_degree'
/usr/lib/libnetcdf.so.12: undefined reference to `H5T_STD_I8BE_g'
/usr/lib/libgdal.so.20: undefined reference to `H5Eset_auto1'
/usr/lib/libnetcdf.so.12: undefined reference to `H5LTopen_file_image'
/usr/lib/libnetcdf.so.12: undefined reference to `H5Screate'
/usr/lib/libgdal.so.20: undefined reference to `H5Eget_auto1'
/usr/lib/libgdal.so.20: undefined reference to `H5Giterate'
/usr/lib/libgdal.so.20: undefined reference to `H5Eauto_is_v2'
/usr/lib/libgdal.so.20: undefined reference to `H5Oclose'
/usr/lib/libgdal.so.20: undefined reference to `H5T_NATIVE_UINT_g'
/usr/lib/libnetcdf.so.12: undefined reference to `H5DSis_scale'
/usr/lib/libnetcdf.so.12: undefined reference to `H5Tcreate'
/usr/lib/libgdal.so.20: undefined reference to `H5T_NATIVE_LONG_g'
/usr/lib/libnetcdf.so.12: undefined reference to `H5Tenum_insert'
/usr/lib/libnetcdf.so.12: undefined reference to `H5Dwrite'
/usr/lib/libnetcdf.so.12: undefined reference to `H5Gmove'
/usr/lib/libnetcdf.so.12: undefined reference to `H5Fflush'
/usr/lib/libnetcdf.so.12: undefined reference to `H5Awrite'
/usr/lib/libgdal.so.20: undefined reference to `H5Fclose'
/usr/lib/libnetcdf.so.12: undefined reference to `H5Tset_cset'
/usr/lib/libnetcdf.so.12: undefined reference to `H5T_STD_U64BE_g'
/usr/lib/libnetcdf.so.12: undefined reference to `H5Aexists'
/usr/lib/libnetcdf.so.12: undefined reference to `H5Tget_super'
/usr/lib/libgdal.so.20: undefined reference to `H5Gclose'
/usr/lib/libnetcdf.so.12: undefined reference to `H5Tset_strpad'
/usr/lib/libgdal.so.20: undefined reference to `H5Tget_native_type'
/usr/lib/libnetcdf.so.12: undefined reference to `H5Tget_array_dims1'
/usr/lib/libnetcdf.so.12: undefined reference to `H5Pset_fill_time'
/usr/lib/libnetcdf.so.12: undefined reference to `H5Tenum_create'
/usr/lib/libnetcdf.so.12: undefined reference to `H5Pset_fletcher32'
/usr/lib/libnetcdf.so.12: undefined reference to `H5Lexists'
/usr/lib/libnetcdf.so.12: undefined reference to `H5T_C_S1_g'
/usr/lib/libnetcdf.so.12: undefined reference to `H5Gcreate2'
/usr/lib/libgdal.so.20: undefined reference to `H5Tget_class'
/usr/lib/libgdal.so.20: undefined reference to `H5T_NATIVE_INT_g'
/usr/lib/libnetcdf.so.12: undefined reference to `H5Tcommit1'
/usr/lib/libnetcdf.so.12: undefined reference to `H5Pset_obj_track_times'
/usr/lib/libnetcdf.so.12: undefined reference to `H5Tget_member_offset'
/usr/lib/libnetcdf.so.12: undefined reference to `H5Tget_member_value'
/usr/lib/libnetcdf.so.12: undefined reference to `H5Tcopy'
/usr/lib/libgdal.so.20: undefined reference to `H5Dopen1'
/usr/lib/libgdal.so.20: undefined reference to `H5T_NATIVE_ULLONG_g'
/usr/lib/libgdal.so.20: undefined reference to `H5Sclose'
/usr/lib/libgdal.so.20: undefined reference to `H5T_NATIVE_LLONG_g'
/usr/lib/libnetcdf.so.12: undefined reference to `H5Dget_access_plist'
/usr/lib/libgdal.so.20: undefined reference to `H5T_NATIVE_SHORT_g'
/usr/lib/libgdal.so.20: undefined reference to `H5T_NATIVE_DOUBLE_g'
/usr/lib/libgdal.so.20: undefined reference to `H5Aread'
/usr/lib/libgdal.so.20: undefined reference to `H5Dclose'
/usr/lib/libnetcdf.so.12: undefined reference to `H5DSdetach_scale'
/usr/lib/libnetcdf.so.12: undefined reference to `H5P_CLS_DATASET_ACCESS_ID_g'
/usr/lib/libnetcdf.so.12: undefined reference to `H5Literate'
/usr/lib/libnetcdf.so.12: undefined reference to `H5DSiterate_scales'
/usr/lib/libgdal.so.20: undefined reference to `H5Sget_simple_extent_dims'
/usr/lib/libnetcdf.so.12: undefined reference to `H5Dcreate2'
/usr/lib/libnetcdf.so.12: undefined reference to `H5Pget_fill_value'
/usr/lib/libnetcdf.so.12: undefined reference to `H5Pset_deflate'
/usr/lib/libnetcdf.so.12: undefined reference to `H5DSattach_scale'
/usr/lib/libgdal.so.20: undefined reference to `H5Gopen1'
/usr/lib/libnetcdf.so.12: undefined reference to `H5Pset_fill_value'
/usr/lib/libgdal.so.20: undefined reference to `H5Fopen'
/usr/lib/libnetcdf.so.12: undefined reference to `H5Tget_array_ndims'
/usr/lib/libnetcdf.so.12: undefined reference to `H5Adelete'
/usr/lib/libnetcdf.so.12: undefined reference to `H5T_STD_U8BE_g'
/usr/lib/libnetcdf.so.12: undefined reference to `H5Sget_simple_extent_type'
/usr/lib/libgdal.so.20: undefined reference to `H5Gget_objinfo'
collect2: error: ld returned 1 exit status
[10273/22392] Building CXX object IO/Geometry/Testing/Cxx/CMakeFiles/vtkIOGeometryCxxTests.dir/TestPTSReader.cxx.o
ninja: build stopped: subcommand failed.
==> ERROR: A failure occurred in build().
Aborting...

jaltonaga commented on 2016-09-01 13:06

I'm getting an error when building with makepkg -s, the output is:

CMake Error at /usr/share/cmake-3.6/Modules/FindPackageHandleStandardArgs.cmake:148 (message):
Could NOT find Java (missing: Java_JAR_EXECUTABLE Java_JAVAC_EXECUTABLE
Java_JAVAH_EXECUTABLE Java_JAVADOC_EXECUTABLE) (found version "1.8.0.102")
Call Stack (most recent call first):
/usr/share/cmake-3.6/Modules/FindPackageHandleStandardArgs.cmake:388 (_FPHSA_FAILURE_MESSAGE)
/usr/share/cmake-3.6/Modules/FindJava.cmake:255 (find_package_handle_standard_args)
Wrapping/Java/CMakeLists.txt:1 (find_package)


CMake Error: The following variables are used in this project, but they are set to NOTFOUND.
Please set them or make sure they are set and tested correctly in the CMake files:
JAVA_INCLUDE_PATH (ADVANCED)
used as include directory in directory /home/jon/vtk-qt4/src/VTK-7.0.0/Common/Core
used as include directory in directory /home/jon/vtk-qt4/src/VTK-7.0.0/Common/Math
used as include directory in directory /home/jon/vtk-qt4/src/VTK-7.0.0/Common/Misc
...
Some other directories
...
used as include directory in directory /home/jon/vtk-qt4/src/VTK-7.0.0/Rendering/VolumeAMR

-- Configuring incomplete, errors occurred!
See also "/home/jon/vtk-qt4/src/build/CMakeFiles/CMakeOutput.log".
See also "/home/jon/vtk-qt4/src/build/CMakeFiles/CMakeError.log".
==> ERROR: A failure occurred in build().
Aborting...

Tempel commented on 2016-05-21 19:48

I'm getting a checksum failure on ffmpeg3.patch. My sha1sum for the file is a78177f8dd6dedd9ad189fa12730ec53c7d02508 which appears to me the value from the previous version of the PKGBUILD. Did you maybe just miss uploading the latest version of this patch file?

saxonbeta commented on 2016-05-15 18:24

Finally is working. I have added a patch to fix gcc 6 compilation and also switched to use the internal source of HDF5 because vtk is incompatible with the newest version (1.10).

@Tempel: I have moved the files to /opt to avoid conflicts with stock vtk package, so elmerfem-git needs to be patched. You can take the patch from https://aur.archlinux.org/packages/elmerfem

Tempel commented on 2016-05-11 00:53

I'm getting a build failure very early on. Looks like this:

CMake Error at CMake/vtkCompilerExtras.cmake:47 (if):
if given arguments:

"cc: error: ARGS: No such file or directory

cc (GCC) 6.1.1 20160501

Copyright (C) 2016 Free Software Foundation, Inc.

This is free software" " see the source for copying conditions. There is
NO

warranty" " not even for MERCHANTABILITY or FITNESS FOR A PARTICULAR
PURPOSE.



" "VERSION_GREATER" "4.2.0" "AND" "BUILD_SHARED_LIBS" "AND"
"HAVE_GCC_VISIBILITY" "AND" "VTK_USE_GCC_VISIBILITY" "AND" "NOT" "MINGW"
"AND" "NOT" "CYGWIN"

Unknown arguments specified
Call Stack (most recent call first):
CMakeLists.txt:283 (include)

saxonbeta commented on 2016-05-04 22:17

Yes, it is, but there is no need. The vtk6 package from community repo is linked against qt5.

ShalokShalom commented on 2016-05-04 19:24

is it possible to build on qt5?

All comments