Package Details: vtk8 8.2.0-21

Git Clone URL: https://aur.archlinux.org/vtk8.git (read-only, click to copy)
Package Base: vtk8
Description: A software system for 3D computer graphics, image processing, and visualization
Upstream URL: https://www.vtk.org/
Licenses: BSD
Conflicts: vtk
Provides: vtk
Submitter: bartus
Maintainer: bartus
Last Packager: bartus
Votes: 0
Popularity: 0.000000
First Submitted: 2021-11-30 10:13 (UTC)
Last Updated: 2021-11-30 10:13 (UTC)

Dependencies (58)

Required by (61)

Sources (7)

Pinned Comments

bartus commented on 2022-03-14 10:37 (UTC)

Sorry lads, I'm at the Polish Ukraine border helping allocate refugees. Expect no update until this hell is over, wish us luck. Have no time nor access to my rig and AUR keys to test/post updates. If you have a patch, ping me on email - I'll add you as co-maintainer. Posted with my old script - https://github.com/bartoszek/aur-post

FabioLolix commented on 2022-02-11 18:18 (UTC)

Hello, this failed to build when was first uploaded and failed to build today with code errors like "error: ‘PyThreadState’ {aka ‘struct _ts’} has no member named ‘exc_type’; did you mean ‘curexc_type’?"

Latest Comments

bartus commented on 2022-03-14 10:37 (UTC)

Sorry lads, I'm at the Polish Ukraine border helping allocate refugees. Expect no update until this hell is over, wish us luck. Have no time nor access to my rig and AUR keys to test/post updates. If you have a patch, ping me on email - I'll add you as co-maintainer. Posted with my old script - https://github.com/bartoszek/aur-post

FabioLolix commented on 2022-02-11 18:18 (UTC)

Hello, this failed to build when was first uploaded and failed to build today with code errors like "error: ‘PyThreadState’ {aka ‘struct _ts’} has no member named ‘exc_type’; did you mean ‘curexc_type’?"

malacology commented on 2021-12-24 00:20 (UTC)

error while making

 71%] Building CXX object Interaction/Widgets/Testing/Cxx/CMakeFiles/vtkInteractionWidgetsCxxTests.dir/TestButtonWidget.cxx.o
[ 71%] Building CXX object Interaction/Widgets/Testing/Cxx/CMakeFiles/vtkInteractionWidgetsCxxTests.dir/TestButtonWidgetMultipleViewports.cxx.o
[ 71%] Building CXX object Interaction/Widgets/Testing/Cxx/CMakeFiles/vtkInteractionWidgetsCxxTests.dir/TestDijkstraGraphGeodesicPath.cxx.o
[ 71%] Building CXX object Interaction/Widgets/Testing/Cxx/CMakeFiles/vtkInteractionWidgetsCxxTests.dir/TestLineWidget.cxx.o
[ 71%] Building CXX object Interaction/Widgets/Testing/Cxx/CMakeFiles/vtkInteractionWidgetsCxxTests.dir/TestLineWidget2.cxx.o
[ 71%] Building CXX object Interaction/Widgets/Testing/Cxx/CMakeFiles/vtkInteractionWidgetsCxxTests.dir/TestOrientedGlyphContour.cxx.o
[ 71%] Building CXX object Interaction/Widgets/Testing/Cxx/CMakeFiles/vtkInteractionWidgetsCxxTests.dir/TestPlaneWidget.cxx.o
[ 71%] Building CXX object Interaction/Widgets/Testing/Cxx/CMakeFiles/vtkInteractionWidgetsCxxTests.dir/TestPointWidget.cxx.o
[ 71%] Building CXX object Interaction/Widgets/Testing/Cxx/CMakeFiles/vtkInteractionWidgetsCxxTests.dir/TestPolyPlane.cxx.o
[ 71%] Building CXX object Interaction/Widgets/Testing/Cxx/CMakeFiles/vtkInteractionWidgetsCxxTests.dir/TestPolygonalHandleRepresentations.cxx.o
[ 71%] Building CXX object Interaction/Widgets/Testing/Cxx/CMakeFiles/vtkInteractionWidgetsCxxTests.dir/TestPolygonalRepresentationHandleWidget.cxx.o
[ 71%] Building CXX object Interaction/Widgets/Testing/Cxx/CMakeFiles/vtkInteractionWidgetsCxxTests.dir/TestPolygonalSurfaceConstrainedDistanceWidget.cxx.o
[ 71%] Building CXX object Interaction/Widgets/Testing/Cxx/CMakeFiles/vtkInteractionWidgetsCxxTests.dir/TestSphereHandleWidget.cxx.o
[ 71%] Building CXX object Interaction/Widgets/Testing/Cxx/CMakeFiles/vtkInteractionWidgetsCxxTests.dir/TestSurfaceConstrainedHandleWidget.cxx.o
[ 71%] Building CXX object Interaction/Widgets/Testing/Cxx/CMakeFiles/vtkInteractionWidgetsCxxTests.dir/TestTensorProbeWidget.cxx.o
[ 71%] Building CXX object Interaction/Widgets/Testing/Cxx/CMakeFiles/vtkInteractionWidgetsCxxTests.dir/TestImageTracerWidget.cxx.o
[ 71%] Building CXX object Interaction/Widgets/Testing/Cxx/CMakeFiles/vtkInteractionWidgetsCxxTests.dir/TestPickingManagerWidgets.cxx.o
[ 71%] Linking CXX executable ../../../../bin/vtkInteractionWidgetsCxxTests
make[2]: 离开目录“/home/guoyi/.cache/yay/vtk8/src/build”
[ 71%] Built target vtkInteractionWidgetsCxxTests
make[2]: 进入目录“/home/guoyi/.cache/yay/vtk8/src/build”
make[2]: 离开目录“/home/guoyi/.cache/yay/vtk8/src/build”
make[2]: 进入目录“/home/guoyi/.cache/yay/vtk8/src/build”
[ 71%] Building CXX object Parallel/Core/Testing/Cxx/CMakeFiles/vtkParallelCoreCxxTests.dir/vtkParallelCoreCxxTests.cxx.o
[ 71%] Building CXX object Parallel/Core/Testing/Cxx/CMakeFiles/vtkParallelCoreCxxTests.dir/TestFieldDataSerialization.cxx.o
[ 71%] Linking CXX executable ../../../../bin/vtkParallelCoreCxxTests
make[2]: 离开目录“/home/guoyi/.cache/yay/vtk8/src/build”
[ 71%] Built target vtkParallelCoreCxxTests
make[2]: 进入目录“/home/guoyi/.cache/yay/vtk8/src/build”
make[2]: 离开目录“/home/guoyi/.cache/yay/vtk8/src/build”
make[2]: 进入目录“/home/guoyi/.cache/yay/vtk8/src/build”
[ 71%] Building CXX object Parallel/Core/Testing/Cxx/CMakeFiles/vtkParallelCore-TestSocketCommunicator.dir/TestSocketCommunicator.cxx.o
[ 71%] Linking CXX executable ../../../../bin/vtkParallelCore-TestSocketCommunicator
make[2]: 离开目录“/home/guoyi/.cache/yay/vtk8/src/build”
[ 71%] Built target vtkParallelCore-TestSocketCommunicator
make[2]: 进入目录“/home/guoyi/.cache/yay/vtk8/src/build”
make[2]: 离开目录“/home/guoyi/.cache/yay/vtk8/src/build”
make[2]: 进入目录“/home/guoyi/.cache/yay/vtk8/src/build”
[ 71%] Building CXX object Parallel/MPI/Testing/Cxx/CMakeFiles/vtkParallelMPICxxTests-MPI.dir/vtkParallelMPICxxTests-MPI.cxx.o
[ 71%] Building CXX object Parallel/MPI/Testing/Cxx/CMakeFiles/vtkParallelMPICxxTests-MPI.dir/TestPProbe.cxx.o
[ 71%] Building CXX object Parallel/MPI/Testing/Cxx/CMakeFiles/vtkParallelMPICxxTests-MPI.dir/GenericCommunicator.cxx.o
[ 71%] Building CXX object Parallel/MPI/Testing/Cxx/CMakeFiles/vtkParallelMPICxxTests-MPI.dir/MPIController.cxx.o
[ 71%] Building CXX object Parallel/MPI/Testing/Cxx/CMakeFiles/vtkParallelMPICxxTests-MPI.dir/PDirectory.cxx.o
[ 71%] Building CXX object Parallel/MPI/Testing/Cxx/CMakeFiles/vtkParallelMPICxxTests-MPI.dir/PSystemTools.cxx.o
[ 71%] Building CXX object Parallel/MPI/Testing/Cxx/CMakeFiles/vtkParallelMPICxxTests-MPI.dir/TestNonBlockingCommunication.cxx.o
[ 71%] Building CXX object Parallel/MPI/Testing/Cxx/CMakeFiles/vtkParallelMPICxxTests-MPI.dir/TestProcess.cxx.o
[ 72%] Building CXX object Parallel/MPI/Testing/Cxx/CMakeFiles/vtkParallelMPICxxTests-MPI.dir/ExerciseMultiProcessController.cxx.o
[ 72%] Linking CXX executable ../../../../bin/vtkParallelMPICxxTests-MPI
make[2]: 离开目录“/home/guoyi/.cache/yay/vtk8/src/build”
[ 72%] Built target vtkParallelMPICxxTests-MPI
make[2]: 进入目录“/home/guoyi/.cache/yay/vtk8/src/build”
make[2]: 离开目录“/home/guoyi/.cache/yay/vtk8/src/build”
make[2]: 进入目录“/home/guoyi/.cache/yay/vtk8/src/build”
[ 72%] copy: __init__.py
[ 72%] copy: __main__.py
[ 72%] copy: include/mpi4py/MPI.pxd
[ 72%] copy: include/mpi4py/__init__.pxd
[ 72%] copy: include/mpi4py/__init__.pyx
[ 72%] copy: include/mpi4py/libmpi.pxd
[ 72%] copy: include/mpi4py/mpi.pxi
[ 72%] copy: include/mpi4py/mpi4py.MPI.h
[ 72%] copy: include/mpi4py/mpi4py.MPI_api.h
[ 72%] copy: include/mpi4py/mpi4py.h
[ 72%] copy: include/mpi4py/mpi4py.i
[ 72%] Generating ../../../lib/python3.10/site-packages/mpi4py/__init__.pyc, ../../../lib/python3.10/site-packages/mpi4py/__main__.pyc, ../../../lib/python3.10/site-packages/mpi4py/__init__.pyo, ../../../lib/python3.10/site-packages/mpi4py/__main__.pyo
Listing '/home/guoyi/.cache/yay/vtk8/src/build/lib/python3.10/site-packages/mpi4py'...
Compiling '/home/guoyi/.cache/yay/vtk8/src/build/lib/python3.10/site-packages/mpi4py/__init__.py'...
Compiling '/home/guoyi/.cache/yay/vtk8/src/build/lib/python3.10/site-packages/mpi4py/__main__.py'...
Listing '/home/guoyi/.cache/yay/vtk8/src/build/lib/python3.10/site-packages/mpi4py/include'...
Listing '/home/guoyi/.cache/yay/vtk8/src/build/lib/python3.10/site-packages/mpi4py/include/mpi4py'...
Listing '/home/guoyi/.cache/yay/vtk8/src/build/lib/python3.10/site-packages/mpi4py/lib-pmpi'...
Listing '/home/guoyi/.cache/yay/vtk8/src/build/lib/python3.10/site-packages/mpi4py'...
Compiling '/home/guoyi/.cache/yay/vtk8/src/build/lib/python3.10/site-packages/mpi4py/__init__.py'...
Compiling '/home/guoyi/.cache/yay/vtk8/src/build/lib/python3.10/site-packages/mpi4py/__main__.py'...
Listing '/home/guoyi/.cache/yay/vtk8/src/build/lib/python3.10/site-packages/mpi4py/include'...
Listing '/home/guoyi/.cache/yay/vtk8/src/build/lib/python3.10/site-packages/mpi4py/include/mpi4py'...
Listing '/home/guoyi/.cache/yay/vtk8/src/build/lib/python3.10/site-packages/mpi4py/lib-pmpi'...
make[2]: 离开目录“/home/guoyi/.cache/yay/vtk8/src/build”
[ 72%] Built target mpi4py
make[2]: 进入目录“/home/guoyi/.cache/yay/vtk8/src/build”
make[2]: 离开目录“/home/guoyi/.cache/yay/vtk8/src/build”
make[2]: 进入目录“/home/guoyi/.cache/yay/vtk8/src/build”
[ 72%] Building C object ThirdParty/mpi4py/vtkmpi4py/CMakeFiles/mpi4py.MPI.dir/src/MPI.c.o
In file included from /home/guoyi/.cache/yay/vtk8/src/VTK-8.2.0/ThirdParty/mpi4py/vtkmpi4py/src/mpi4py.MPI.c:432,
                 from /home/guoyi/.cache/yay/vtk8/src/VTK-8.2.0/ThirdParty/mpi4py/vtkmpi4py/src/MPI.c:4:
/home/guoyi/.cache/yay/vtk8/src/VTK-8.2.0/ThirdParty/mpi4py/vtkmpi4py/src/mpi4py.MPI.c: 在函数‘__pyx_f_6mpi4py_3MPI_del_Datatype’中:
/home/guoyi/.cache/yay/vtk8/src/VTK-8.2.0/ThirdParty/mpi4py/vtkmpi4py/src/mpi4py.MPI.c:14831:36: 错误:expected ‘)’ before ‘;’ token
14831 |   __pyx_t_1 = (((__pyx_v_ob[0]) == MPI_UB) != 0);
      |                                    ^~~~~~
In file included from /home/guoyi/.cache/yay/vtk8/src/VTK-8.2.0/ThirdParty/mpi4py/vtkmpi4py/src/MPI.c:4:
/home/guoyi/.cache/yay/vtk8/src/VTK-8.2.0/ThirdParty/mpi4py/vtkmpi4py/src/mpi4py.MPI.c:14831:16: 附注:to match this ‘(’
14831 |   __pyx_t_1 = (((__pyx_v_ob[0]) == MPI_UB) != 0);
      |                ^
In file included from /home/guoyi/.cache/yay/vtk8/src/VTK-8.2.0/ThirdParty/mpi4py/vtkmpi4py/src/mpi4py.MPI.c:432,
                 from /home/guoyi/.cache/yay/vtk8/src/VTK-8.2.0/ThirdParty/mpi4py/vtkmpi4py/src/MPI.c:4:
/home/guoyi/.cache/yay/vtk8/src/VTK-8.2.0/ThirdParty/mpi4py/vtkmpi4py/src/mpi4py.MPI.c:14844:36: 错误:expected ‘)’ before ‘;’ token
14844 |   __pyx_t_1 = (((__pyx_v_ob[0]) == MPI_LB) != 0);
      |                                    ^~~~~~
In file included from /home/guoyi/.cache/yay/vtk8/src/VTK-8.2.0/ThirdParty/mpi4py/vtkmpi4py/src/MPI.c:4:
/home/guoyi/.cache/yay/vtk8/src/VTK-8.2.0/ThirdParty/mpi4py/vtkmpi4py/src/mpi4py.MPI.c:14844:16: 附注:to match this ‘(’
14844 |   __pyx_t_1 = (((__pyx_v_ob[0]) == MPI_LB) != 0);
      |                ^
In file included from /home/guoyi/.cache/yay/vtk8/src/VTK-8.2.0/ThirdParty/mpi4py/vtkmpi4py/src/mpi4py.MPI.c:432,
                 from /home/guoyi/.cache/yay/vtk8/src/VTK-8.2.0/ThirdParty/mpi4py/vtkmpi4py/src/MPI.c:4:
/home/guoyi/.cache/yay/vtk8/src/VTK-8.2.0/ThirdParty/mpi4py/vtkmpi4py/src/mpi4py.MPI.c: 在函数‘__pyx_pf_6mpi4py_3MPI_8Datatype_44Free’中:
/home/guoyi/.cache/yay/vtk8/src/VTK-8.2.0/ThirdParty/mpi4py/vtkmpi4py/src/mpi4py.MPI.c:62598:17: 错误:静态断言错误:"MPI_UB was removed in MPI-3.0.  Use MPI_Type_create_resized instead."
62598 |     __pyx_v_p = MPI_UB;
      |                 ^~~~~~
/home/guoyi/.cache/yay/vtk8/src/VTK-8.2.0/ThirdParty/mpi4py/vtkmpi4py/src/mpi4py.MPI.c:62612:17: 错误:静态断言错误:"MPI_LB was removed in MPI-3.0.  Use MPI_Type_create_resized instead."
62612 |     __pyx_v_p = MPI_LB;
      |                 ^~~~~~
In file included from /home/guoyi/.cache/yay/vtk8/src/VTK-8.2.0/ThirdParty/mpi4py/vtkmpi4py/src/MPI.c:4:
/home/guoyi/.cache/yay/vtk8/src/VTK-8.2.0/ThirdParty/mpi4py/vtkmpi4py/src/mpi4py.MPI.c: 在函数‘__pyx_tp_dealloc_6mpi4py_3MPI_Datatype’中:
/home/guoyi/.cache/yay/vtk8/src/VTK-8.2.0/ThirdParty/mpi4py/vtkmpi4py/src/mpi4py.MPI.c:145688:5: 错误:自增操作数必须是左值
145688 |     ++Py_REFCNT(o);
       |     ^~
/home/guoyi/.cache/yay/vtk8/src/VTK-8.2.0/ThirdParty/mpi4py/vtkmpi4py/src/mpi4py.MPI.c:145690:5: 错误:自减操作数必须是左值
145690 |     --Py_REFCNT(o);
       |     ^~
/home/guoyi/.cache/yay/vtk8/src/VTK-8.2.0/ThirdParty/mpi4py/vtkmpi4py/src/mpi4py.MPI.c: 在函数‘__pyx_tp_dealloc_6mpi4py_3MPI_Request’中:
/home/guoyi/.cache/yay/vtk8/src/VTK-8.2.0/ThirdParty/mpi4py/vtkmpi4py/src/mpi4py.MPI.c:145967:5: 错误:自增操作数必须是左值
145967 |     ++Py_REFCNT(o);
       |     ^~
/home/guoyi/.cache/yay/vtk8/src/VTK-8.2.0/ThirdParty/mpi4py/vtkmpi4py/src/mpi4py.MPI.c:145969:5: 错误:自减操作数必须是左值
145969 |     --Py_REFCNT(o);
       |     ^~
/home/guoyi/.cache/yay/vtk8/src/VTK-8.2.0/ThirdParty/mpi4py/vtkmpi4py/src/mpi4py.MPI.c: 在函数‘__pyx_tp_dealloc_6mpi4py_3MPI_Message’中:
/home/guoyi/.cache/yay/vtk8/src/VTK-8.2.0/ThirdParty/mpi4py/vtkmpi4py/src/mpi4py.MPI.c:146314:5: 错误:自增操作数必须是左值
146314 |     ++Py_REFCNT(o);
       |     ^~
/home/guoyi/.cache/yay/vtk8/src/VTK-8.2.0/ThirdParty/mpi4py/vtkmpi4py/src/mpi4py.MPI.c:146316:5: 错误:自减操作数必须是左值
146316 |     --Py_REFCNT(o);
       |     ^~
/home/guoyi/.cache/yay/vtk8/src/VTK-8.2.0/ThirdParty/mpi4py/vtkmpi4py/src/mpi4py.MPI.c: 在函数‘__pyx_tp_dealloc_6mpi4py_3MPI_Op’中:
/home/guoyi/.cache/yay/vtk8/src/VTK-8.2.0/ThirdParty/mpi4py/vtkmpi4py/src/mpi4py.MPI.c:146499:5: 错误:自增操作数必须是左值
146499 |     ++Py_REFCNT(o);
       |     ^~
/home/guoyi/.cache/yay/vtk8/src/VTK-8.2.0/ThirdParty/mpi4py/vtkmpi4py/src/mpi4py.MPI.c:146501:5: 错误:自减操作数必须是左值
146501 |     --Py_REFCNT(o);
       |     ^~
/home/guoyi/.cache/yay/vtk8/src/VTK-8.2.0/ThirdParty/mpi4py/vtkmpi4py/src/mpi4py.MPI.c: 在函数‘__pyx_tp_dealloc_6mpi4py_3MPI_Group’中:
/home/guoyi/.cache/yay/vtk8/src/VTK-8.2.0/ThirdParty/mpi4py/vtkmpi4py/src/mpi4py.MPI.c:146675:5: 错误:自增操作数必须是左值
146675 |     ++Py_REFCNT(o);
       |     ^~
/home/guoyi/.cache/yay/vtk8/src/VTK-8.2.0/ThirdParty/mpi4py/vtkmpi4py/src/mpi4py.MPI.c:146677:5: 错误:自减操作数必须是左值
146677 |     --Py_REFCNT(o);
       |     ^~
/home/guoyi/.cache/yay/vtk8/src/VTK-8.2.0/ThirdParty/mpi4py/vtkmpi4py/src/mpi4py.MPI.c: 在函数‘__pyx_tp_dealloc_6mpi4py_3MPI_Info’中:
/home/guoyi/.cache/yay/vtk8/src/VTK-8.2.0/ThirdParty/mpi4py/vtkmpi4py/src/mpi4py.MPI.c:146860:5: 错误:自增操作数必须是左值
146860 |     ++Py_REFCNT(o);
       |     ^~
/home/guoyi/.cache/yay/vtk8/src/VTK-8.2.0/ThirdParty/mpi4py/vtkmpi4py/src/mpi4py.MPI.c:146862:5: 错误:自减操作数必须是左值
146862 |     --Py_REFCNT(o);
       |     ^~
/home/guoyi/.cache/yay/vtk8/src/VTK-8.2.0/ThirdParty/mpi4py/vtkmpi4py/src/mpi4py.MPI.c: 在函数‘__pyx_tp_dealloc_6mpi4py_3MPI_Errhandler’中:
/home/guoyi/.cache/yay/vtk8/src/VTK-8.2.0/ThirdParty/mpi4py/vtkmpi4py/src/mpi4py.MPI.c:147067:5: 错误:自增操作数必须是左值
147067 |     ++Py_REFCNT(o);
       |     ^~
/home/guoyi/.cache/yay/vtk8/src/VTK-8.2.0/ThirdParty/mpi4py/vtkmpi4py/src/mpi4py.MPI.c:147069:5: 错误:自减操作数必须是左值
147069 |     --Py_REFCNT(o);
       |     ^~
/home/guoyi/.cache/yay/vtk8/src/VTK-8.2.0/ThirdParty/mpi4py/vtkmpi4py/src/mpi4py.MPI.c: 在函数‘__pyx_tp_dealloc_6mpi4py_3MPI_Comm’中:
/home/guoyi/.cache/yay/vtk8/src/VTK-8.2.0/ThirdParty/mpi4py/vtkmpi4py/src/mpi4py.MPI.c:147226:5: 错误:自增操作数必须是左值
147226 |     ++Py_REFCNT(o);
       |     ^~
/home/guoyi/.cache/yay/vtk8/src/VTK-8.2.0/ThirdParty/mpi4py/vtkmpi4py/src/mpi4py.MPI.c:147228:5: 错误:自减操作数必须是左值
147228 |     --Py_REFCNT(o);
       |     ^~
/home/guoyi/.cache/yay/vtk8/src/VTK-8.2.0/ThirdParty/mpi4py/vtkmpi4py/src/mpi4py.MPI.c: 在函数‘__pyx_tp_dealloc_6mpi4py_3MPI_Win’中:
/home/guoyi/.cache/yay/vtk8/src/VTK-8.2.0/ThirdParty/mpi4py/vtkmpi4py/src/mpi4py.MPI.c:148164:5: 错误:自增操作数必须是左值
148164 |     ++Py_REFCNT(o);
       |     ^~
/home/guoyi/.cache/yay/vtk8/src/VTK-8.2.0/ThirdParty/mpi4py/vtkmpi4py/src/mpi4py.MPI.c:148166:5: 错误:自减操作数必须是左值
148166 |     --Py_REFCNT(o);
       |     ^~
/home/guoyi/.cache/yay/vtk8/src/VTK-8.2.0/ThirdParty/mpi4py/vtkmpi4py/src/mpi4py.MPI.c: 在函数‘__pyx_tp_dealloc_6mpi4py_3MPI_File’中:
/home/guoyi/.cache/yay/vtk8/src/VTK-8.2.0/ThirdParty/mpi4py/vtkmpi4py/src/mpi4py.MPI.c:148444:5: 错误:自增操作数必须是左值
148444 |     ++Py_REFCNT(o);
       |     ^~
/home/guoyi/.cache/yay/vtk8/src/VTK-8.2.0/ThirdParty/mpi4py/vtkmpi4py/src/mpi4py.MPI.c:148446:5: 错误:自减操作数必须是左值
148446 |     --Py_REFCNT(o);
       |     ^~
/home/guoyi/.cache/yay/vtk8/src/VTK-8.2.0/ThirdParty/mpi4py/vtkmpi4py/src/mpi4py.MPI.c: 在函数‘__pyx_tp_dealloc_6mpi4py_3MPI__p_buffer’中:
/home/guoyi/.cache/yay/vtk8/src/VTK-8.2.0/ThirdParty/mpi4py/vtkmpi4py/src/mpi4py.MPI.c:148699:5: 错误:自增操作数必须是左值
148699 |     ++Py_REFCNT(o);
       |     ^~
/home/guoyi/.cache/yay/vtk8/src/VTK-8.2.0/ThirdParty/mpi4py/vtkmpi4py/src/mpi4py.MPI.c:148701:5: 错误:自减操作数必须是左值
148701 |     --Py_REFCNT(o);
       |     ^~
/home/guoyi/.cache/yay/vtk8/src/VTK-8.2.0/ThirdParty/mpi4py/vtkmpi4py/src/mpi4py.MPI.c: 在函数‘__pyx_tp_dealloc_6mpi4py_3MPI__p_mem’中:
/home/guoyi/.cache/yay/vtk8/src/VTK-8.2.0/ThirdParty/mpi4py/vtkmpi4py/src/mpi4py.MPI.c:148838:5: 错误:自增操作数必须是左值
148838 |     ++Py_REFCNT(o);
       |     ^~
/home/guoyi/.cache/yay/vtk8/src/VTK-8.2.0/ThirdParty/mpi4py/vtkmpi4py/src/mpi4py.MPI.c:148840:5: 错误:自减操作数必须是左值
148840 |     --Py_REFCNT(o);
       |     ^~
/home/guoyi/.cache/yay/vtk8/src/VTK-8.2.0/ThirdParty/mpi4py/vtkmpi4py/src/mpi4py.MPI.c: 在函数‘PyInit_MPI’中:
/home/guoyi/.cache/yay/vtk8/src/VTK-8.2.0/ThirdParty/mpi4py/vtkmpi4py/src/mpi4py.MPI.c:152303:19: 错误:‘PyTypeObject’ {或称 ‘struct _typeobject’}没有名为‘tp_print’的成员
152303 |   PyMPIStatus_Type.tp_print = 0;
       |                   ^
/home/guoyi/.cache/yay/vtk8/src/VTK-8.2.0/ThirdParty/mpi4py/vtkmpi4py/src/mpi4py.MPI.c:152307:21: 错误:‘PyTypeObject’ {或称 ‘struct _typeobject’}没有名为‘tp_print’的成员
152307 |   PyMPIDatatype_Type.tp_print = 0;
       |                     ^
/home/guoyi/.cache/yay/vtk8/src/VTK-8.2.0/ThirdParty/mpi4py/vtkmpi4py/src/mpi4py.MPI.c:152311:20: 错误:‘PyTypeObject’ {或称 ‘struct _typeobject’}没有名为‘tp_print’的成员
152311 |   PyMPIRequest_Type.tp_print = 0;
       |                    ^
/home/guoyi/.cache/yay/vtk8/src/VTK-8.2.0/ThirdParty/mpi4py/vtkmpi4py/src/mpi4py.MPI.c:152316:21: 错误:‘PyTypeObject’ {或称 ‘struct _typeobject’}没有名为‘tp_print’的成员
152316 |   PyMPIPrequest_Type.tp_print = 0;
       |                     ^
/home/guoyi/.cache/yay/vtk8/src/VTK-8.2.0/ThirdParty/mpi4py/vtkmpi4py/src/mpi4py.MPI.c:152321:21: 错误:‘PyTypeObject’ {或称 ‘struct _typeobject’}没有名为‘tp_print’的成员
152321 |   PyMPIGrequest_Type.tp_print = 0;
       |                     ^
/home/guoyi/.cache/yay/vtk8/src/VTK-8.2.0/ThirdParty/mpi4py/vtkmpi4py/src/mpi4py.MPI.c:152325:20: 错误:‘PyTypeObject’ {或称 ‘struct _typeobject’}没有名为‘tp_print’的成员
152325 |   PyMPIMessage_Type.tp_print = 0;
       |                    ^
/home/guoyi/.cache/yay/vtk8/src/VTK-8.2.0/ThirdParty/mpi4py/vtkmpi4py/src/mpi4py.MPI.c:152329:15: 错误:‘PyTypeObject’ {或称 ‘struct _typeobject’}没有名为‘tp_print’的成员
152329 |   PyMPIOp_Type.tp_print = 0;
       |               ^
/home/guoyi/.cache/yay/vtk8/src/VTK-8.2.0/ThirdParty/mpi4py/vtkmpi4py/src/mpi4py.MPI.c:152333:18: 错误:‘PyTypeObject’ {或称 ‘struct _typeobject’}没有名为‘tp_print’的成员
152333 |   PyMPIGroup_Type.tp_print = 0;
       |                  ^
/home/guoyi/.cache/yay/vtk8/src/VTK-8.2.0/ThirdParty/mpi4py/vtkmpi4py/src/mpi4py.MPI.c:152337:17: 错误:‘PyTypeObject’ {或称 ‘struct _typeobject’}没有名为‘tp_print’的成员
152337 |   PyMPIInfo_Type.tp_print = 0;
       |                 ^
/home/guoyi/.cache/yay/vtk8/src/VTK-8.2.0/ThirdParty/mpi4py/vtkmpi4py/src/mpi4py.MPI.c:152341:23: 错误:‘PyTypeObject’ {或称 ‘struct _typeobject’}没有名为‘tp_print’的成员
152341 |   PyMPIErrhandler_Type.tp_print = 0;
       |                       ^
/home/guoyi/.cache/yay/vtk8/src/VTK-8.2.0/ThirdParty/mpi4py/vtkmpi4py/src/mpi4py.MPI.c:152345:17: 错误:‘PyTypeObject’ {或称 ‘struct _typeobject’}没有名为‘tp_print’的成员
152345 |   PyMPIComm_Type.tp_print = 0;
       |                 ^
/home/guoyi/.cache/yay/vtk8/src/VTK-8.2.0/ThirdParty/mpi4py/vtkmpi4py/src/mpi4py.MPI.c:152350:22: 错误:‘PyTypeObject’ {或称 ‘struct _typeobject’}没有名为‘tp_print’的成员
152350 |   PyMPIIntracomm_Type.tp_print = 0;
       |                      ^
/home/guoyi/.cache/yay/vtk8/src/VTK-8.2.0/ThirdParty/mpi4py/vtkmpi4py/src/mpi4py.MPI.c:152355:21: 错误:‘PyTypeObject’ {或称 ‘struct _typeobject’}没有名为‘tp_print’的成员
152355 |   PyMPITopocomm_Type.tp_print = 0;
       |                     ^
/home/guoyi/.cache/yay/vtk8/src/VTK-8.2.0/ThirdParty/mpi4py/vtkmpi4py/src/mpi4py.MPI.c:152360:21: 错误:‘PyTypeObject’ {或称 ‘struct _typeobject’}没有名为‘tp_print’的成员
152360 |   PyMPICartcomm_Type.tp_print = 0;
       |                     ^
/home/guoyi/.cache/yay/vtk8/src/VTK-8.2.0/ThirdParty/mpi4py/vtkmpi4py/src/mpi4py.MPI.c:152365:22: 错误:‘PyTypeObject’ {或称 ‘struct _typeobject’}没有名为‘tp_print’的成员
152365 |   PyMPIGraphcomm_Type.tp_print = 0;
       |                      ^
/home/guoyi/.cache/yay/vtk8/src/VTK-8.2.0/ThirdParty/mpi4py/vtkmpi4py/src/mpi4py.MPI.c:152370:26: 错误:‘PyTypeObject’ {或称 ‘struct _typeobject’}没有名为‘tp_print’的成员
152370 |   PyMPIDistgraphcomm_Type.tp_print = 0;
       |                          ^
/home/guoyi/.cache/yay/vtk8/src/VTK-8.2.0/ThirdParty/mpi4py/vtkmpi4py/src/mpi4py.MPI.c:152375:22: 错误:‘PyTypeObject’ {或称 ‘struct _typeobject’}没有名为‘tp_print’的成员
152375 |   PyMPIIntercomm_Type.tp_print = 0;
       |                      ^
/home/guoyi/.cache/yay/vtk8/src/VTK-8.2.0/ThirdParty/mpi4py/vtkmpi4py/src/mpi4py.MPI.c:152379:16: 错误:‘PyTypeObject’ {或称 ‘struct _typeobject’}没有名为‘tp_print’的成员
152379 |   PyMPIWin_Type.tp_print = 0;
       |                ^
/home/guoyi/.cache/yay/vtk8/src/VTK-8.2.0/ThirdParty/mpi4py/vtkmpi4py/src/mpi4py.MPI.c:152383:17: 错误:‘PyTypeObject’ {或称 ‘struct _typeobject’}没有名为‘tp_print’的成员
152383 |   PyMPIFile_Type.tp_print = 0;
       |                 ^
/home/guoyi/.cache/yay/vtk8/src/VTK-8.2.0/ThirdParty/mpi4py/vtkmpi4py/src/mpi4py.MPI.c:152387:36: 错误:‘PyTypeObject’ {或称 ‘struct _typeobject’}没有名为‘tp_print’的成员
152387 |   __pyx_type_6mpi4py_3MPI__p_buffer.tp_print = 0;
       |                                    ^
/home/guoyi/.cache/yay/vtk8/src/VTK-8.2.0/ThirdParty/mpi4py/vtkmpi4py/src/mpi4py.MPI.c:152390:33: 错误:‘PyTypeObject’ {或称 ‘struct _typeobject’}没有名为‘tp_print’的成员
152390 |   __pyx_type_6mpi4py_3MPI__p_mem.tp_print = 0;
       |                                 ^
/home/guoyi/.cache/yay/vtk8/src/VTK-8.2.0/ThirdParty/mpi4py/vtkmpi4py/src/mpi4py.MPI.c:152393:36: 错误:‘PyTypeObject’ {或称 ‘struct _typeobject’}没有名为‘tp_print’的成员
152393 |   __pyx_type_6mpi4py_3MPI__p_keyval.tp_print = 0;
       |                                    ^
/home/guoyi/.cache/yay/vtk8/src/VTK-8.2.0/ThirdParty/mpi4py/vtkmpi4py/src/mpi4py.MPI.c:152400:34: 错误:‘PyTypeObject’ {或称 ‘struct _typeobject’}没有名为‘tp_print’的成员
152400 |   __pyx_type_6mpi4py_3MPI__p_greq.tp_print = 0;
       |                                  ^
/home/guoyi/.cache/yay/vtk8/src/VTK-8.2.0/ThirdParty/mpi4py/vtkmpi4py/src/mpi4py.MPI.c:152408:37: 错误:‘PyTypeObject’ {或称 ‘struct _typeobject’}没有名为‘tp_print’的成员
152408 |   __pyx_type_6mpi4py_3MPI__p_datarep.tp_print = 0;
       |                                     ^
/home/guoyi/.cache/yay/vtk8/src/VTK-8.2.0/ThirdParty/mpi4py/vtkmpi4py/src/mpi4py.MPI.c:152412:37: 错误:‘PyTypeObject’ {或称 ‘struct _typeobject’}没有名为‘tp_print’的成员
152412 |   __pyx_type_6mpi4py_3MPI__p_message.tp_print = 0;
       |                                     ^
/home/guoyi/.cache/yay/vtk8/src/VTK-8.2.0/ThirdParty/mpi4py/vtkmpi4py/src/mpi4py.MPI.c:152418:37: 错误:‘PyTypeObject’ {或称 ‘struct _typeobject’}没有名为‘tp_print’的成员
152418 |   __pyx_type_6mpi4py_3MPI__p_msg_p2p.tp_print = 0;
       |                                     ^
/home/guoyi/.cache/yay/vtk8/src/VTK-8.2.0/ThirdParty/mpi4py/vtkmpi4py/src/mpi4py.MPI.c:152440:37: 错误:‘PyTypeObject’ {或称 ‘struct _typeobject’}没有名为‘tp_print’的成员
152440 |   __pyx_type_6mpi4py_3MPI__p_msg_cco.tp_print = 0;
       |                                     ^
/home/guoyi/.cache/yay/vtk8/src/VTK-8.2.0/ThirdParty/mpi4py/vtkmpi4py/src/mpi4py.MPI.c:152447:38: 错误:‘PyTypeObject’ {或称 ‘struct _typeobject’}没有名为‘tp_print’的成员
152447 |   __pyx_type_6mpi4py_3MPI__p_msg_ccow.tp_print = 0;
       |                                      ^
/home/guoyi/.cache/yay/vtk8/src/VTK-8.2.0/ThirdParty/mpi4py/vtkmpi4py/src/mpi4py.MPI.c:152457:37: 错误:‘PyTypeObject’ {或称 ‘struct _typeobject’}没有名为‘tp_print’的成员
152457 |   __pyx_type_6mpi4py_3MPI__p_msg_rma.tp_print = 0;
       |                                     ^
/home/guoyi/.cache/yay/vtk8/src/VTK-8.2.0/ThirdParty/mpi4py/vtkmpi4py/src/mpi4py.MPI.c:152464:36: 错误:‘PyTypeObject’ {或称 ‘struct _typeobject’}没有名为‘tp_print’的成员
152464 |   __pyx_type_6mpi4py_3MPI__p_msg_io.tp_print = 0;
       |                                    ^
/home/guoyi/.cache/yay/vtk8/src/VTK-8.2.0/ThirdParty/mpi4py/vtkmpi4py/src/mpi4py.MPI.c:152475:33: 错误:‘PyTypeObject’ {或称 ‘struct _typeobject’}没有名为‘tp_print’的成员
152475 |   __pyx_type_6mpi4py_3MPI_Pickle.tp_print = 0;
       |                                 ^
In file included from /home/guoyi/.cache/yay/vtk8/src/VTK-8.2.0/ThirdParty/mpi4py/vtkmpi4py/src/mpi4py.MPI.c:432,
                 from /home/guoyi/.cache/yay/vtk8/src/VTK-8.2.0/ThirdParty/mpi4py/vtkmpi4py/src/MPI.c:4:
/home/guoyi/.cache/yay/vtk8/src/VTK-8.2.0/ThirdParty/mpi4py/vtkmpi4py/src/mpi4py.MPI.c:155712:62: 错误:expected ‘)’ before ‘;’ token
155712 |   __pyx_t_3 = ((PyObject *)__pyx_f_6mpi4py_3MPI_new_Datatype(MPI_UB)); if (unlikely(!__pyx_t_3)) __PYX_ERR(6, 868, __pyx_L1_error)
       |                                                              ^~~~~~
In file included from /home/guoyi/.cache/yay/vtk8/src/VTK-8.2.0/ThirdParty/mpi4py/vtkmpi4py/src/MPI.c:4:
/home/guoyi/.cache/yay/vtk8/src/VTK-8.2.0/ThirdParty/mpi4py/vtkmpi4py/src/mpi4py.MPI.c:155712:61: 附注:to match this ‘(’
155712 |   __pyx_t_3 = ((PyObject *)__pyx_f_6mpi4py_3MPI_new_Datatype(MPI_UB)); if (unlikely(!__pyx_t_3)) __PYX_ERR(6, 868, __pyx_L1_error)
       |                                                             ^
In file included from /home/guoyi/.cache/yay/vtk8/src/VTK-8.2.0/ThirdParty/mpi4py/vtkmpi4py/src/mpi4py.MPI.c:432,
                 from /home/guoyi/.cache/yay/vtk8/src/VTK-8.2.0/ThirdParty/mpi4py/vtkmpi4py/src/MPI.c:4:
/home/guoyi/.cache/yay/vtk8/src/VTK-8.2.0/ThirdParty/mpi4py/vtkmpi4py/src/mpi4py.MPI.c:155726:62: 错误:expected ‘)’ before ‘;’ token
155726 |   __pyx_t_3 = ((PyObject *)__pyx_f_6mpi4py_3MPI_new_Datatype(MPI_LB)); if (unlikely(!__pyx_t_3)) __PYX_ERR(6, 869, __pyx_L1_error)
       |                                                              ^~~~~~
In file included from /home/guoyi/.cache/yay/vtk8/src/VTK-8.2.0/ThirdParty/mpi4py/vtkmpi4py/src/MPI.c:4:
/home/guoyi/.cache/yay/vtk8/src/VTK-8.2.0/ThirdParty/mpi4py/vtkmpi4py/src/mpi4py.MPI.c:155726:61: 附注:to match this ‘(’
155726 |   __pyx_t_3 = ((PyObject *)__pyx_f_6mpi4py_3MPI_new_Datatype(MPI_LB)); if (unlikely(!__pyx_t_3)) __PYX_ERR(6, 869, __pyx_L1_error)
       |                                                             ^
/home/guoyi/.cache/yay/vtk8/src/VTK-8.2.0/ThirdParty/mpi4py/vtkmpi4py/src/mpi4py.MPI.c: 在函数‘__Pyx_PyCFunction_FastCall’中:
/home/guoyi/.cache/yay/vtk8/src/VTK-8.2.0/ThirdParty/mpi4py/vtkmpi4py/src/mpi4py.MPI.c:163017:13: 错误:提供给函数‘(PyObject * (*)(PyObject *, PyObject * const*, Py_ssize_t))meth’的实参太多
163017 |     return (*((__Pyx_PyCFunctionFast)meth)) (self, args, nargs, NULL);
       |            ~^~~~~~~~~~~~~~~~~~~~~~~~~~~~~~~
In file included from /home/guoyi/.cache/yay/vtk8/src/VTK-8.2.0/ThirdParty/mpi4py/vtkmpi4py/src/MPI.c:4:
/home/guoyi/.cache/yay/vtk8/src/VTK-8.2.0/ThirdParty/mpi4py/vtkmpi4py/src/mpi4py.MPI.c: 在函数‘__Pyx__ExceptionSave’中:
/home/guoyi/.cache/yay/vtk8/src/VTK-8.2.0/ThirdParty/mpi4py/vtkmpi4py/src/mpi4py.MPI.c:163228:21: 错误:‘PyThreadState’ {或称 ‘struct _ts’} has no member named ‘exc_type’; did you mean ‘curexc_type’?
163228 |     *type = tstate->exc_type;
       |                     ^~~~~~~~
       |                     curexc_type
/home/guoyi/.cache/yay/vtk8/src/VTK-8.2.0/ThirdParty/mpi4py/vtkmpi4py/src/mpi4py.MPI.c:163229:22: 错误:‘PyThreadState’ {或称 ‘struct _ts’} has no member named ‘exc_value’; did you mean ‘curexc_value’?
163229 |     *value = tstate->exc_value;
       |                      ^~~~~~~~~
       |                      curexc_value
/home/guoyi/.cache/yay/vtk8/src/VTK-8.2.0/ThirdParty/mpi4py/vtkmpi4py/src/mpi4py.MPI.c:163230:19: 错误:‘PyThreadState’ {或称 ‘struct _ts’} has no member named ‘exc_traceback’; did you mean ‘curexc_traceback’?
163230 |     *tb = tstate->exc_traceback;
       |                   ^~~~~~~~~~~~~
       |                   curexc_traceback
/home/guoyi/.cache/yay/vtk8/src/VTK-8.2.0/ThirdParty/mpi4py/vtkmpi4py/src/mpi4py.MPI.c: 在函数‘__Pyx__ExceptionReset’中:
/home/guoyi/.cache/yay/vtk8/src/VTK-8.2.0/ThirdParty/mpi4py/vtkmpi4py/src/mpi4py.MPI.c:163237:24: 错误:‘PyThreadState’ {或称 ‘struct _ts’} has no member named ‘exc_type’; did you mean ‘curexc_type’?
163237 |     tmp_type = tstate->exc_type;
       |                        ^~~~~~~~
       |                        curexc_type
/home/guoyi/.cache/yay/vtk8/src/VTK-8.2.0/ThirdParty/mpi4py/vtkmpi4py/src/mpi4py.MPI.c:163238:25: 错误:‘PyThreadState’ {或称 ‘struct _ts’} has no member named ‘exc_value’; did you mean ‘curexc_value’?
163238 |     tmp_value = tstate->exc_value;
       |                         ^~~~~~~~~
       |                         curexc_value
/home/guoyi/.cache/yay/vtk8/src/VTK-8.2.0/ThirdParty/mpi4py/vtkmpi4py/src/mpi4py.MPI.c:163239:22: 错误:‘PyThreadState’ {或称 ‘struct _ts’} has no member named ‘exc_traceback’; did you mean ‘curexc_traceback’?
163239 |     tmp_tb = tstate->exc_traceback;
       |                      ^~~~~~~~~~~~~
       |                      curexc_traceback
/home/guoyi/.cache/yay/vtk8/src/VTK-8.2.0/ThirdParty/mpi4py/vtkmpi4py/src/mpi4py.MPI.c:163240:13: 错误:‘PyThreadState’ {或称 ‘struct _ts’} has no member named ‘exc_type’; did you mean ‘curexc_type’?
163240 |     tstate->exc_type = type;
       |             ^~~~~~~~
       |             curexc_type
/home/guoyi/.cache/yay/vtk8/src/VTK-8.2.0/ThirdParty/mpi4py/vtkmpi4py/src/mpi4py.MPI.c:163241:13: 错误:‘PyThreadState’ {或称 ‘struct _ts’} has no member named ‘exc_value’; did you mean ‘curexc_value’?
163241 |     tstate->exc_value = value;
       |             ^~~~~~~~~
       |             curexc_value
/home/guoyi/.cache/yay/vtk8/src/VTK-8.2.0/ThirdParty/mpi4py/vtkmpi4py/src/mpi4py.MPI.c:163242:13: 错误:‘PyThreadState’ {或称 ‘struct _ts’} has no member named ‘exc_traceback’; did you mean ‘curexc_traceback’?
163242 |     tstate->exc_traceback = tb;
       |             ^~~~~~~~~~~~~
       |             curexc_traceback
/home/guoyi/.cache/yay/vtk8/src/VTK-8.2.0/ThirdParty/mpi4py/vtkmpi4py/src/mpi4py.MPI.c: 在函数‘__Pyx__GetException’中:
/home/guoyi/.cache/yay/vtk8/src/VTK-8.2.0/ThirdParty/mpi4py/vtkmpi4py/src/mpi4py.MPI.c:163287:24: 错误:‘PyThreadState’ {或称 ‘struct _ts’} has no member named ‘exc_type’; did you mean ‘curexc_type’?
163287 |     tmp_type = tstate->exc_type;
       |                        ^~~~~~~~
       |                        curexc_type
/home/guoyi/.cache/yay/vtk8/src/VTK-8.2.0/ThirdParty/mpi4py/vtkmpi4py/src/mpi4py.MPI.c:163288:25: 错误:‘PyThreadState’ {或称 ‘struct _ts’} has no member named ‘exc_value’; did you mean ‘curexc_value’?
163288 |     tmp_value = tstate->exc_value;
       |                         ^~~~~~~~~
       |                         curexc_value
/home/guoyi/.cache/yay/vtk8/src/VTK-8.2.0/ThirdParty/mpi4py/vtkmpi4py/src/mpi4py.MPI.c:163289:22: 错误:‘PyThreadState’ {或称 ‘struct _ts’} has no member named ‘exc_traceback’; did you mean ‘curexc_traceback’?
163289 |     tmp_tb = tstate->exc_traceback;
       |                      ^~~~~~~~~~~~~
       |                      curexc_traceback
/home/guoyi/.cache/yay/vtk8/src/VTK-8.2.0/ThirdParty/mpi4py/vtkmpi4py/src/mpi4py.MPI.c:163290:13: 错误:‘PyThreadState’ {或称 ‘struct _ts’} has no member named ‘exc_type’; did you mean ‘curexc_type’?
163290 |     tstate->exc_type = local_type;
       |             ^~~~~~~~
       |             curexc_type
/home/guoyi/.cache/yay/vtk8/src/VTK-8.2.0/ThirdParty/mpi4py/vtkmpi4py/src/mpi4py.MPI.c:163291:13: 错误:‘PyThreadState’ {或称 ‘struct _ts’} has no member named ‘exc_value’; did you mean ‘curexc_value’?
163291 |     tstate->exc_value = local_value;
       |             ^~~~~~~~~
       |             curexc_value
/home/guoyi/.cache/yay/vtk8/src/VTK-8.2.0/ThirdParty/mpi4py/vtkmpi4py/src/mpi4py.MPI.c:163292:13: 错误:‘PyThreadState’ {或称 ‘struct _ts’} has no member named ‘exc_traceback’; did you mean ‘curexc_traceback’?
163292 |     tstate->exc_traceback = local_tb;
       |             ^~~~~~~~~~~~~
       |             curexc_traceback
In file included from /home/guoyi/.cache/yay/vtk8/src/VTK-8.2.0/ThirdParty/mpi4py/vtkmpi4py/src/MPI.c:4:
/home/guoyi/.cache/yay/vtk8/src/VTK-8.2.0/ThirdParty/mpi4py/vtkmpi4py/src/mpi4py.MPI.c: 在函数‘__Pyx__ExceptionSwap’中:
/home/guoyi/.cache/yay/vtk8/src/VTK-8.2.0/ThirdParty/mpi4py/vtkmpi4py/src/mpi4py.MPI.c:164080:24: 错误:‘PyThreadState’ {或称 ‘struct _ts’} has no member named ‘exc_type’; did you mean ‘curexc_type’?
164080 |     tmp_type = tstate->exc_type;
       |                        ^~~~~~~~
       |                        curexc_type
/home/guoyi/.cache/yay/vtk8/src/VTK-8.2.0/ThirdParty/mpi4py/vtkmpi4py/src/mpi4py.MPI.c:164081:25: 错误:‘PyThreadState’ {或称 ‘struct _ts’} has no member named ‘exc_value’; did you mean ‘curexc_value’?
164081 |     tmp_value = tstate->exc_value;
       |                         ^~~~~~~~~
       |                         curexc_value
/home/guoyi/.cache/yay/vtk8/src/VTK-8.2.0/ThirdParty/mpi4py/vtkmpi4py/src/mpi4py.MPI.c:164082:22: 错误:‘PyThreadState’ {或称 ‘struct _ts’} has no member named ‘exc_traceback’; did you mean ‘curexc_traceback’?
164082 |     tmp_tb = tstate->exc_traceback;
       |                      ^~~~~~~~~~~~~
       |                      curexc_traceback
/home/guoyi/.cache/yay/vtk8/src/VTK-8.2.0/ThirdParty/mpi4py/vtkmpi4py/src/mpi4py.MPI.c:164083:13: 错误:‘PyThreadState’ {或称 ‘struct _ts’} has no member named ‘exc_type’; did you mean ‘curexc_type’?
164083 |     tstate->exc_type = *type;
       |             ^~~~~~~~
       |             curexc_type
/home/guoyi/.cache/yay/vtk8/src/VTK-8.2.0/ThirdParty/mpi4py/vtkmpi4py/src/mpi4py.MPI.c:164084:13: 错误:‘PyThreadState’ {或称 ‘struct _ts’} has no member named ‘exc_value’; did you mean ‘curexc_value’?
164084 |     tstate->exc_value = *value;
       |             ^~~~~~~~~
       |             curexc_value
/home/guoyi/.cache/yay/vtk8/src/VTK-8.2.0/ThirdParty/mpi4py/vtkmpi4py/src/mpi4py.MPI.c:164085:13: 错误:‘PyThreadState’ {或称 ‘struct _ts’} has no member named ‘exc_traceback’; did you mean ‘curexc_traceback’?
164085 |     tstate->exc_traceback = *tb;
       |             ^~~~~~~~~~~~~
       |             curexc_traceback
In file included from /home/guoyi/.cache/yay/vtk8/src/VTK-8.2.0/ThirdParty/mpi4py/vtkmpi4py/src/MPI.c:4:
/home/guoyi/.cache/yay/vtk8/src/VTK-8.2.0/ThirdParty/mpi4py/vtkmpi4py/src/mpi4py.MPI.c: 在函数‘__Pyx_PyDict_Items’中:
/home/guoyi/.cache/yay/vtk8/src/VTK-8.2.0/ThirdParty/mpi4py/vtkmpi4py/src/mpi4py.MPI.c:1851:83: 错误:提供给函数‘(PyObject * (*)(PyObject *, PyObject * const*, Py_ssize_t))__pyx_umethod_PyDict_Type_items.func’的实参太多
 1851 |               (PY_VERSION_HEX >= 0x030600B1 && (cfunc)->flag == METH_FASTCALL ?  (*(__Pyx_PyCFunctionFast)(cfunc)->func)(self, &PyTuple_GET_ITEM(__pyx_empty_tuple, 0), 0, NULL) :\
      |                                                                                  ~^~~~~~~~~~~~~~~~~~~~~~~~~~~~~~~~~~~~~~
/home/guoyi/.cache/yay/vtk8/src/VTK-8.2.0/ThirdParty/mpi4py/vtkmpi4py/src/mpi4py.MPI.c:164279:16: 附注:in expansion of macro ‘__Pyx_CallUnboundCMethod0’
164279 |         return __Pyx_CallUnboundCMethod0(&__pyx_umethod_PyDict_Type_items, d);
       |                ^~~~~~~~~~~~~~~~~~~~~~~~~
make[2]: *** [ThirdParty/mpi4py/vtkmpi4py/CMakeFiles/mpi4py.MPI.dir/build.make:76:ThirdParty/mpi4py/vtkmpi4py/CMakeFiles/mpi4py.MPI.dir/src/MPI.c.o] 错误 1
make[2]: 离开目录“/home/guoyi/.cache/yay/vtk8/src/build”
make[1]: *** [CMakeFiles/Makefile2:39010:ThirdParty/mpi4py/vtkmpi4py/CMakeFiles/mpi4py.MPI.dir/all] 错误 2
make[1]: 离开目录“/home/guoyi/.cache/yay/vtk8/src/build”
make: *** [Makefile:166:all] 错误 2
make: 离开目录“/home/guoyi/.cache/yay/vtk8/src/build”