Package Details: vvc-vtm 23.3-1

Git Clone URL: https://aur.archlinux.org/vvc-vtm.git (read-only, click to copy)
Package Base: vvc-vtm
Description: VTM reference software for VVC (H.266)
Upstream URL: https://vcgit.hhi.fraunhofer.de/jvet/VVCSoftware_VTM
Licenses: BSD
Submitter: PumpkinCheshire
Maintainer: petronny (AutoUpdateBot, PumpkinCheshire)
Last Packager: AutoUpdateBot
Votes: 1
Popularity: 0.000088
First Submitted: 2021-08-30 03:33 (UTC)
Last Updated: 2024-04-23 08:04 (UTC)

Latest Comments

Freed commented on 2022-12-08 13:44 (UTC)

failed

❯ yay -S vvc-vtm
:: Checking for conflicts...
:: Checking for inner conflicts...
[Aur:1]  vvc-vtm-14.0-1

:: (1/1) Downloaded PKGBUILD: vvc-vtm
  1 vvc-vtm                                  (Build Files Exist)
==> Diffs to show?
==> [N]one [A]ll [Ab]ort [I]nstalled [No]tInstalled or (1 2 3, 1-3, ^4)
==>
:: (1/1) Parsing SRCINFO: vvc-vtm
==> Making package: vvc-vtm 14.0-1 (Thu 08 Dec 2022 09:42:08 PM CST)
==> Retrieving sources...
  -> Downloading vvc-vtm.tar.gz...
  % Total    % Received % Xferd  Average Speed   Time    Time     Time  Current
                                 Dload  Upload   Total   Spent    Left  Speed
100 7634k    0 7634k    0     0   251k      0 --:--:--  0:00:30 --:--:--  486k
==> Validating source files with b2sums...
    vvc-vtm.tar.gz ... Passed
==> Making package: vvc-vtm 14.0-1 (Thu 08 Dec 2022 09:42:40 PM CST)
==> Checking runtime dependencies...
==> Checking buildtime dependencies...
==> Retrieving sources...
  -> Found vvc-vtm.tar.gz
==> Validating source files with b2sums...
    vvc-vtm.tar.gz ... Passed
==> Removing existing $srcdir/ directory...
==> Extracting sources...
  -> Extracting vvc-vtm.tar.gz with bsdtar
==> Sources are ready.
==> Making package: vvc-vtm 14.0-1 (Thu 08 Dec 2022 09:42:41 PM CST)
==> Checking runtime dependencies...
==> Checking buildtime dependencies...
==> WARNING: Using existing $srcdir/ tree
==> Starting build()...
-- The C compiler identification is GNU 12.2.0
-- The CXX compiler identification is GNU 12.2.0
-- Detecting C compiler ABI info
-- Detecting C compiler ABI info - done
-- Check for working C compiler: /usr/bin/cc - skipped
-- Detecting C compile features
-- Detecting C compile features - done
-- Detecting CXX compiler ABI info
-- Detecting CXX compiler ABI info - done
-- Check for working CXX compiler: /usr/bin/c++ - skipped
-- Detecting CXX compile features
-- Detecting CXX compile features - done
-- Setting up BBuildEnv 3.14.4.4
-- bb_enable_warnings:  -> updating warnings flags: -Wall;-fdiagnostics-show-option;-Werror;-Wno-sign-compare;-Wno-class-memaccess
-- Configuring done
-- Generating done
-- Build files have been written to: /home/wzy/.cache/yay/vvc-vtm/src/VVCSoftware_VTM-VTM-14.0/build
/home/wzy/.cache/yay/vvc-vtm/src/VVCSoftware_VTM-VTM-14.0/cmake/CMakeBuild/bin/cmake.py -j  -b  variant=debug
Launching: /usr/bin/cmake -G Unix Makefiles -DCMAKE_BUILD_TYPE:STRING=Debug -S /home/wzy/.cache/yay/vvc-vtm/src/VVCSoftware_VTM-VTM-14.0 -B /home/wzy/.cache/yay/vvc-vtm/src/VVCSoftware_VTM-VTM-14.0/build/umake/gcc-12.2/x86_64/debug
-- The C compiler identification is GNU 12.2.0
-- The CXX compiler identification is GNU 12.2.0
-- Detecting C compiler ABI info
-- Detecting C compiler ABI info - done
-- Check for working C compiler: /usr/bin/cc - skipped
-- Detecting C compile features
-- Detecting C compile features - done
-- Detecting CXX compiler ABI info
-- Detecting CXX compiler ABI info - done
-- Check for working CXX compiler: /usr/bin/c++ - skipped
-- Detecting CXX compile features
-- Detecting CXX compile features - done
-- Setting up BBuildEnv 3.14.4.4
-- bb_enable_warnings:  -> updating warnings flags: -Wall;-fdiagnostics-show-option;-Werror;-Wno-sign-compare;-Wno-class-memaccess
-- Configuring done
-- Generating done
-- Build files have been written to: /home/wzy/.cache/yay/vvc-vtm/src/VVCSoftware_VTM-VTM-14.0/build/umake/gcc-12.2/x86_64/debug
Launching: /usr/bin/cmake --build /home/wzy/.cache/yay/vvc-vtm/src/VVCSoftware_VTM-VTM-14.0/build/umake/gcc-12.2/x86_64/debug --parallel 16
[  2%] Building CXX object source/Lib/CommonLib/CMakeFiles/CommonLib.dir/AdaptiveLoopFilter.cpp.o
[  2%] Building CXX object source/Lib/CommonAnalyserLib/CMakeFiles/CommonAnalyserLib.dir/__/CommonLib/AffineGradientSearch.cpp.o
[  4%] Building CXX object source/Lib/CommonAnalyserLib/CMakeFiles/CommonAnalyserLib.dir/__/CommonLib/AdaptiveLoopFilter.cpp.o
[  4%] Building CXX object source/Lib/CommonLib/CMakeFiles/CommonLib.dir/BitStream.cpp.o
[  4%] Building CXX object source/Lib/CommonLib/CMakeFiles/CommonLib.dir/AffineGradientSearch.cpp.o
[  4%] Building CXX object source/Lib/CommonAnalyserLib/CMakeFiles/CommonAnalyserLib.dir/__/CommonLib/BitStream.cpp.o
[  4%] Building CXX object source/Lib/CommonLib/CMakeFiles/CommonLib.dir/CacheModel.cpp.o
[  5%] Building CXX object source/Lib/CommonAnalyserLib/CMakeFiles/CommonAnalyserLib.dir/__/CommonLib/Buffer.cpp.o
[  5%] Building CXX object source/Lib/CommonLib/CMakeFiles/CommonLib.dir/ChromaFormat.cpp.o
[  5%] Building CXX object source/Lib/CommonLib/CMakeFiles/CommonLib.dir/Buffer.cpp.o
[  6%] Building CXX object source/Lib/CommonLib/CMakeFiles/CommonLib.dir/CodingStructure.cpp.o
[  6%] Building CXX object source/Lib/CommonAnalyserLib/CMakeFiles/CommonAnalyserLib.dir/__/CommonLib/CacheModel.cpp.o
[  6%] Building CXX object source/Lib/CommonAnalyserLib/CMakeFiles/CommonAnalyserLib.dir/__/CommonLib/ChromaFormat.cpp.o
[  7%] Building CXX object source/Lib/CommonLib/CMakeFiles/CommonLib.dir/ContextModelling.cpp.o
[  8%] Building CXX object source/Lib/CommonAnalyserLib/CMakeFiles/CommonAnalyserLib.dir/__/CommonLib/CodingStructure.cpp.o
[  8%] Building CXX object source/Lib/CommonLib/CMakeFiles/CommonLib.dir/Contexts.cpp.o
In file included from /home/wzy/.cache/yay/vvc-vtm/src/VVCSoftware_VTM-VTM-14.0/source/Lib/CommonLib/ChromaFormat.h:37,
                 from /home/wzy/.cache/yay/vvc-vtm/src/VVCSoftware_VTM-VTM-14.0/source/Lib/CommonLib/ChromaFormat.cpp:35:
/home/wzy/.cache/yay/vvc-vtm/src/VVCSoftware_VTM-VTM-14.0/source/Lib/CommonLib/Common.h:150:34: error: ‘template<class _Arg, class _Result> struct std::unary_function’ is deprecated [-Werror=deprecated-declarations]
  150 |   struct hash<Position> : public unary_function<Position, uint64_t>
      |                                  ^~~~~~~~~~~~~~
In file included from /usr/include/c++/12.2.0/string:48,
                 from /usr/include/c++/12.2.0/bits/locale_classes.h:40,
                 from /usr/include/c++/12.2.0/bits/ios_base.h:41,
                 from /usr/include/c++/12.2.0/ios:42,
                 from /usr/include/c++/12.2.0/ostream:38,
                 from /usr/include/c++/12.2.0/iostream:39,
                 from /home/wzy/.cache/yay/vvc-vtm/src/VVCSoftware_VTM-VTM-14.0/source/Lib/CommonLib/CommonDef.h:42,
                 from /home/wzy/.cache/yay/vvc-vtm/src/VVCSoftware_VTM-VTM-14.0/source/Lib/CommonLib/Common.h:41:
/usr/include/c++/12.2.0/bits/stl_function.h:117:12: note: declared here
  117 |     struct unary_function
      |            ^~~~~~~~~~~~~~
/home/wzy/.cache/yay/vvc-vtm/src/VVCSoftware_VTM-VTM-14.0/source/Lib/CommonLib/Common.h:159:30: error: ‘template<class _Arg, class _Result> struct std::unary_function’ is deprecated [-Werror=deprecated-declarations]
  159 |   struct hash<Size> : public unary_function<Size, uint64_t>
      |                              ^~~~~~~~~~~~~~
/usr/include/c++/12.2.0/bits/stl_function.h:117:12: note: declared here
  117 |     struct unary_function
      |            ^~~~~~~~~~~~~~
In file included from /home/wzy/.cache/yay/vvc-vtm/src/VVCSoftware_VTM-VTM-14.0/source/Lib/CommonLib/Unit.h:42,
                 from /home/wzy/.cache/yay/vvc-vtm/src/VVCSoftware_VTM-VTM-14.0/source/Lib/CommonLib/Buffer.cpp:41:
/home/wzy/.cache/yay/vvc-vtm/src/VVCSoftware_VTM-VTM-14.0/source/Lib/CommonLib/Common.h:150:34: error: ‘template<class _Arg, class _Result> struct std::unary_function’ is deprecated [-Werror=deprecated-declarations]
  150 |   struct hash<Position> : public unary_function<Position, uint64_t>
      |                                  ^~~~~~~~~~~~~~
In file included from /home/wzy/.cache/yay/vvc-vtm/src/VVCSoftware_VTM-VTM-14.0/source/Lib/CommonLib/Unit.h:42,
                 from /home/wzy/.cache/yay/vvc-vtm/src/VVCSoftware_VTM-VTM-14.0/source/Lib/CommonLib/Buffer.cpp:41:
/home/wzy/.cache/yay/vvc-vtm/src/VVCSoftware_VTM-VTM-14.0/source/Lib/CommonLib/Common.h:150:34: error: ‘template<class _Arg, class _Result> struct std::unary_function’ is deprecated [-Werror=deprecated-declarations]
  150 |   struct hash<Position> : public unary_function<Position, uint64_t>
      |                                  ^~~~~~~~~~~~~~
In file included from /usr/include/c++/12.2.0/string:48,
                 from /usr/include/c++/12.2.0/bits/locale_classes.h:40,
                 from /usr/include/c++/12.2.0/bits/ios_base.h:41,
                 from /usr/include/c++/12.2.0/ios:42,
                 from /usr/include/c++/12.2.0/ostream:38,
                 from /usr/include/c++/12.2.0/iostream:39,
                 from /home/wzy/.cache/yay/vvc-vtm/src/VVCSoftware_VTM-VTM-14.0/source/Lib/CommonLib/CommonDef.h:42,
                 from /home/wzy/.cache/yay/vvc-vtm/src/VVCSoftware_VTM-VTM-14.0/source/Lib/CommonLib/Unit.h:41:
/usr/include/c++/12.2.0/bits/stl_function.h:117:12: note: declared here
  117 |     struct unary_function
      |            ^~~~~~~~~~~~~~
/home/wzy/.cache/yay/vvc-vtm/src/VVCSoftware_VTM-VTM-14.0/source/Lib/CommonLib/Common.h:159:30: error: ‘template<class _Arg, class _Result> struct std::unary_function’ is deprecated [-Werror=deprecated-declarations]
  159 |   struct hash<Size> : public unary_function<Size, uint64_t>
      |                              ^~~~~~~~~~~~~~
/usr/include/c++/12.2.0/bits/stl_function.h:117:12: note: declared here
  117 |     struct unary_function
      |            ^~~~~~~~~~~~~~
In file included from /home/wzy/.cache/yay/vvc-vtm/src/VVCSoftware_VTM-VTM-14.0/source/Lib/CommonLib/ChromaFormat.h:37,
                 from /home/wzy/.cache/yay/vvc-vtm/src/VVCSoftware_VTM-VTM-14.0/source/Lib/CommonLib/ChromaFormat.cpp:35:
/home/wzy/.cache/yay/vvc-vtm/src/VVCSoftware_VTM-VTM-14.0/source/Lib/CommonLib/Common.h:150:34: error: ‘template<class _Arg, class _Result> struct std::unary_function’ is deprecated [-Werror=deprecated-declarations]
  150 |   struct hash<Position> : public unary_function<Position, uint64_t>
      |                                  ^~~~~~~~~~~~~~
In file included from /usr/include/c++/12.2.0/string:48,
                 from /usr/include/c++/12.2.0/bits/locale_classes.h:40,
                 from /usr/include/c++/12.2.0/bits/ios_base.h:41,
                 from /usr/include/c++/12.2.0/ios:42,
                 from /usr/include/c++/12.2.0/ostream:38,
                 from /usr/include/c++/12.2.0/iostream:39,
                 from /home/wzy/.cache/yay/vvc-vtm/src/VVCSoftware_VTM-VTM-14.0/source/Lib/CommonLib/CommonDef.h:42,
                 from /home/wzy/.cache/yay/vvc-vtm/src/VVCSoftware_VTM-VTM-14.0/source/Lib/CommonLib/Common.h:41:
/usr/include/c++/12.2.0/bits/stl_function.h:117:12: note: declared here
  117 |     struct unary_function
      |            ^~~~~~~~~~~~~~
/home/wzy/.cache/yay/vvc-vtm/src/VVCSoftware_VTM-VTM-14.0/source/Lib/CommonLib/Common.h:159:30: error: ‘template<class _Arg, class _Result> struct std::unary_function’ is deprecated [-Werror=deprecated-declarations]
  159 |   struct hash<Size> : public unary_function<Size, uint64_t>
      |                              ^~~~~~~~~~~~~~
/usr/include/c++/12.2.0/bits/stl_function.h:117:12: note: declared here
  117 |     struct unary_function
      |            ^~~~~~~~~~~~~~
In file included from /usr/include/c++/12.2.0/string:48,
                 from /usr/include/c++/12.2.0/bits/locale_classes.h:40,
                 from /usr/include/c++/12.2.0/bits/ios_base.h:41,
                 from /usr/include/c++/12.2.0/ios:42,
                 from /usr/include/c++/12.2.0/ostream:38,
                 from /usr/include/c++/12.2.0/iostream:39,
                 from /home/wzy/.cache/yay/vvc-vtm/src/VVCSoftware_VTM-VTM-14.0/source/Lib/CommonLib/CommonDef.h:42,
                 from /home/wzy/.cache/yay/vvc-vtm/src/VVCSoftware_VTM-VTM-14.0/source/Lib/CommonLib/Unit.h:41:
/usr/include/c++/12.2.0/bits/stl_function.h:117:12: note: declared here
  117 |     struct unary_function
      |            ^~~~~~~~~~~~~~
/home/wzy/.cache/yay/vvc-vtm/src/VVCSoftware_VTM-VTM-14.0/source/Lib/CommonLib/Common.h:159:30: error: ‘template<class _Arg, class _Result> struct std::unary_function’ is deprecated [-Werror=deprecated-declarations]
  159 |   struct hash<Size> : public unary_function<Size, uint64_t>
      |                              ^~~~~~~~~~~~~~
/usr/include/c++/12.2.0/bits/stl_function.h:117:12: note: declared here
  117 |     struct unary_function
      |            ^~~~~~~~~~~~~~
In file included from /home/wzy/.cache/yay/vvc-vtm/src/VVCSoftware_VTM-VTM-14.0/source/Lib/CommonLib/Unit.h:43:
/home/wzy/.cache/yay/vvc-vtm/src/VVCSoftware_VTM-VTM-14.0/source/Lib/CommonLib/Mv.h:276:28: error: ‘template<class _Arg, class _Result> struct std::unary_function’ is deprecated [-Werror=deprecated-declarations]
  276 |   struct hash<Mv> : public unary_function<Mv, uint64_t>
      |                            ^~~~~~~~~~~~~~
/usr/include/c++/12.2.0/bits/stl_function.h:117:12: note: declared here
  117 |     struct unary_function
      |            ^~~~~~~~~~~~~~
In file included from /home/wzy/.cache/yay/vvc-vtm/src/VVCSoftware_VTM-VTM-14.0/source/Lib/CommonLib/Unit.h:43,
                 from /home/wzy/.cache/yay/vvc-vtm/src/VVCSoftware_VTM-VTM-14.0/source/Lib/CommonLib/TrQuant.h:42,
                 from /home/wzy/.cache/yay/vvc-vtm/src/VVCSoftware_VTM-VTM-14.0/source/Lib/CommonLib/ChromaFormat.cpp:36:
/home/wzy/.cache/yay/vvc-vtm/src/VVCSoftware_VTM-VTM-14.0/source/Lib/CommonLib/Mv.h:276:28: error: ‘template<class _Arg, class _Result> struct std::unary_function’ is deprecated [-Werror=deprecated-declarations]
  276 |   struct hash<Mv> : public unary_function<Mv, uint64_t>
      |                            ^~~~~~~~~~~~~~
/usr/include/c++/12.2.0/bits/stl_function.h:117:12: note: declared here
  117 |     struct unary_function
      |            ^~~~~~~~~~~~~~
In file included from /home/wzy/.cache/yay/vvc-vtm/src/VVCSoftware_VTM-VTM-14.0/source/Lib/CommonLib/Unit.h:42,
                 from /home/wzy/.cache/yay/vvc-vtm/src/VVCSoftware_VTM-VTM-14.0/source/Lib/CommonLib/CodingStructure.h:41,
                 from /home/wzy/.cache/yay/vvc-vtm/src/VVCSoftware_VTM-VTM-14.0/source/Lib/CommonLib/CodingStructure.cpp:38:
/home/wzy/.cache/yay/vvc-vtm/src/VVCSoftware_VTM-VTM-14.0/source/Lib/CommonLib/Common.h:150:34: error: ‘template<class _Arg, class _Result> struct std::unary_function’ is deprecated [-Werror=deprecated-declarations]
  150 |   struct hash<Position> : public unary_function<Position, uint64_t>
      |                                  ^~~~~~~~~~~~~~
In file included from /home/wzy/.cache/yay/vvc-vtm/src/VVCSoftware_VTM-VTM-14.0/source/Lib/CommonLib/Unit.h:42,
                 from /home/wzy/.cache/yay/vvc-vtm/src/VVCSoftware_VTM-VTM-14.0/source/Lib/CommonLib/AdaptiveLoopFilter.h:43,
                 from /home/wzy/.cache/yay/vvc-vtm/src/VVCSoftware_VTM-VTM-14.0/source/Lib/CommonLib/AdaptiveLoopFilter.cpp:38:
/home/wzy/.cache/yay/vvc-vtm/src/VVCSoftware_VTM-VTM-14.0/source/Lib/CommonLib/Common.h:150:34: error: ‘template<class _Arg, class _Result> struct std::unary_function’ is deprecated [-Werror=deprecated-declarations]
  150 |   struct hash<Position> : public unary_function<Position, uint64_t>
      |                                  ^~~~~~~~~~~~~~
In file included from /usr/include/c++/12.2.0/string:48,
                 from /usr/include/c++/12.2.0/bits/locale_classes.h:40,
                 from /usr/include/c++/12.2.0/bits/ios_base.h:41,
                 from /usr/include/c++/12.2.0/ios:42,
                 from /usr/include/c++/12.2.0/ostream:38,
                 from /usr/include/c++/12.2.0/iostream:39,
                 from /home/wzy/.cache/yay/vvc-vtm/src/VVCSoftware_VTM-VTM-14.0/source/Lib/CommonLib/CommonDef.h:42,
                 from /home/wzy/.cache/yay/vvc-vtm/src/VVCSoftware_VTM-VTM-14.0/source/Lib/CommonLib/Unit.h:41:
/usr/include/c++/12.2.0/bits/stl_function.h:117:12: note: declared here
  117 |     struct unary_function
      |            ^~~~~~~~~~~~~~
In file included from /usr/include/c++/12.2.0/string:48,
                 from /usr/include/c++/12.2.0/bits/locale_classes.h:40,
                 from /usr/include/c++/12.2.0/bits/ios_base.h:41,
                 from /usr/include/c++/12.2.0/ios:42,
                 from /usr/include/c++/12.2.0/ostream:38,
                 from /usr/include/c++/12.2.0/iostream:39,
                 from /home/wzy/.cache/yay/vvc-vtm/src/VVCSoftware_VTM-VTM-14.0/source/Lib/CommonLib/CommonDef.h:42,
                 from /home/wzy/.cache/yay/vvc-vtm/src/VVCSoftware_VTM-VTM-14.0/source/Lib/CommonLib/AdaptiveLoopFilter.h:41:
/usr/include/c++/12.2.0/bits/stl_function.h:117:12: note: declared here
  117 |     struct unary_function
      |            ^~~~~~~~~~~~~~
In file included from /home/wzy/.cache/yay/vvc-vtm/src/VVCSoftware_VTM-VTM-14.0/source/Lib/CommonLib/Unit.h:43,
                 from /home/wzy/.cache/yay/vvc-vtm/src/VVCSoftware_VTM-VTM-14.0/source/Lib/CommonLib/TrQuant.h:42,
                 from /home/wzy/.cache/yay/vvc-vtm/src/VVCSoftware_VTM-VTM-14.0/source/Lib/CommonLib/ChromaFormat.cpp:36:
/home/wzy/.cache/yay/vvc-vtm/src/VVCSoftware_VTM-VTM-14.0/source/Lib/CommonLib/Mv.h:276:28: error: ‘template<class _Arg, class _Result> struct std::unary_function’ is deprecated [-Werror=deprecated-declarations]
  276 |   struct hash<Mv> : public unary_function<Mv, uint64_t>
      |                            ^~~~~~~~~~~~~~
/usr/include/c++/12.2.0/bits/stl_function.h:117:12: note: declared here
  117 |     struct unary_function
      |            ^~~~~~~~~~~~~~
/home/wzy/.cache/yay/vvc-vtm/src/VVCSoftware_VTM-VTM-14.0/source/Lib/CommonLib/Common.h:159:30: error: ‘template<class _Arg, class _Result> struct std::unary_function’ is deprecated [-Werror=deprecated-declarations]
  159 |   struct hash<Size> : public unary_function<Size, uint64_t>
      |                              ^~~~~~~~~~~~~~
/usr/include/c++/12.2.0/bits/stl_function.h:117:12: note: declared here
  117 |     struct unary_function
      |            ^~~~~~~~~~~~~~
/home/wzy/.cache/yay/vvc-vtm/src/VVCSoftware_VTM-VTM-14.0/source/Lib/CommonLib/Common.h:159:30: error: ‘template<class _Arg, class _Result> struct std::unary_function’ is deprecated [-Werror=deprecated-declarations]
  159 |   struct hash<Size> : public unary_function<Size, uint64_t>
      |                              ^~~~~~~~~~~~~~
/usr/include/c++/12.2.0/bits/stl_function.h:117:12: note: declared here
  117 |     struct unary_function
      |            ^~~~~~~~~~~~~~
In file included from /home/wzy/.cache/yay/vvc-vtm/src/VVCSoftware_VTM-VTM-14.0/source/Lib/CommonLib/Unit.h:43:
/home/wzy/.cache/yay/vvc-vtm/src/VVCSoftware_VTM-VTM-14.0/source/Lib/CommonLib/Mv.h:276:28: error: ‘template<class _Arg, class _Result> struct std::unary_function’ is deprecated [-Werror=deprecated-declarations]
  276 |   struct hash<Mv> : public unary_function<Mv, uint64_t>
      |                            ^~~~~~~~~~~~~~
/usr/include/c++/12.2.0/bits/stl_function.h:117:12: note: declared here
  117 |     struct unary_function
      |            ^~~~~~~~~~~~~~
In file included from /home/wzy/.cache/yay/vvc-vtm/src/VVCSoftware_VTM-VTM-14.0/source/Lib/CommonLib/Unit.h:42,
                 from /home/wzy/.cache/yay/vvc-vtm/src/VVCSoftware_VTM-VTM-14.0/source/Lib/CommonLib/CodingStructure.h:41,
                 from /home/wzy/.cache/yay/vvc-vtm/src/VVCSoftware_VTM-VTM-14.0/source/Lib/CommonLib/CodingStructure.cpp:38:
/home/wzy/.cache/yay/vvc-vtm/src/VVCSoftware_VTM-VTM-14.0/source/Lib/CommonLib/Common.h:150:34: error: ‘template<class _Arg, class _Result> struct std::unary_function’ is deprecated [-Werror=deprecated-declarations]
  150 |   struct hash<Position> : public unary_function<Position, uint64_t>
      |                                  ^~~~~~~~~~~~~~
In file included from /usr/include/c++/12.2.0/string:48,
                 from /usr/include/c++/12.2.0/bits/locale_classes.h:40,
                 from /usr/include/c++/12.2.0/bits/ios_base.h:41,
                 from /usr/include/c++/12.2.0/ios:42,
                 from /usr/include/c++/12.2.0/ostream:38,
                 from /usr/include/c++/12.2.0/iostream:39,
                 from /home/wzy/.cache/yay/vvc-vtm/src/VVCSoftware_VTM-VTM-14.0/source/Lib/CommonLib/CommonDef.h:42,
                 from /home/wzy/.cache/yay/vvc-vtm/src/VVCSoftware_VTM-VTM-14.0/source/Lib/CommonLib/Unit.h:41:
/usr/include/c++/12.2.0/bits/stl_function.h:117:12: note: declared here
  117 |     struct unary_function
      |            ^~~~~~~~~~~~~~
/home/wzy/.cache/yay/vvc-vtm/src/VVCSoftware_VTM-VTM-14.0/source/Lib/CommonLib/Common.h:159:30: error: ‘template<class _Arg, class _Result> struct std::unary_function’ is deprecated [-Werror=deprecated-declarations]
  159 |   struct hash<Size> : public unary_function<Size, uint64_t>
      |                              ^~~~~~~~~~~~~~
/usr/include/c++/12.2.0/bits/stl_function.h:117:12: note: declared here
  117 |     struct unary_function
      |            ^~~~~~~~~~~~~~
In file included from /home/wzy/.cache/yay/vvc-vtm/src/VVCSoftware_VTM-VTM-14.0/source/Lib/CommonLib/Rom.h:42,
                 from /home/wzy/.cache/yay/vvc-vtm/src/VVCSoftware_VTM-VTM-14.0/source/Lib/CommonLib/ContextModelling.h:41,
                 from /home/wzy/.cache/yay/vvc-vtm/src/VVCSoftware_VTM-VTM-14.0/source/Lib/CommonLib/ContextModelling.cpp:38:
/home/wzy/.cache/yay/vvc-vtm/src/VVCSoftware_VTM-VTM-14.0/source/Lib/CommonLib/Common.h:150:34: error: ‘template<class _Arg, class _Result> struct std::unary_function’ is deprecated [-Werror=deprecated-declarations]
  150 |   struct hash<Position> : public unary_function<Position, uint64_t>
      |                                  ^~~~~~~~~~~~~~
In file included from /usr/include/c++/12.2.0/string:48,
                 from /usr/include/c++/12.2.0/bits/locale_classes.h:40,
                 from /usr/include/c++/12.2.0/bits/ios_base.h:41,
                 from /usr/include/c++/12.2.0/ios:42,
                 from /usr/include/c++/12.2.0/ostream:38,
                 from /usr/include/c++/12.2.0/iostream:39,
                 from /home/wzy/.cache/yay/vvc-vtm/src/VVCSoftware_VTM-VTM-14.0/source/Lib/CommonLib/CommonDef.h:42,
                 from /home/wzy/.cache/yay/vvc-vtm/src/VVCSoftware_VTM-VTM-14.0/source/Lib/CommonLib/Rom.h:41:
/usr/include/c++/12.2.0/bits/stl_function.h:117:12: note: declared here
  117 |     struct unary_function
      |            ^~~~~~~~~~~~~~
/home/wzy/.cache/yay/vvc-vtm/src/VVCSoftware_VTM-VTM-14.0/source/Lib/CommonLib/Common.h:159:30: error: ‘template<class _Arg, class _Result> struct std::unary_function’ is deprecated [-Werror=deprecated-declarations]
  159 |   struct hash<Size> : public unary_function<Size, uint64_t>
      |                              ^~~~~~~~~~~~~~
/usr/include/c++/12.2.0/bits/stl_function.h:117:12: note: declared here
  117 |     struct unary_function
      |            ^~~~~~~~~~~~~~
In file included from /home/wzy/.cache/yay/vvc-vtm/src/VVCSoftware_VTM-VTM-14.0/source/Lib/CommonLib/Unit.h:43:
/home/wzy/.cache/yay/vvc-vtm/src/VVCSoftware_VTM-VTM-14.0/source/Lib/CommonLib/Mv.h:276:28: error: ‘template<class _Arg, class _Result> struct std::unary_function’ is deprecated [-Werror=deprecated-declarations]
  276 |   struct hash<Mv> : public unary_function<Mv, uint64_t>
      |                            ^~~~~~~~~~~~~~
/usr/include/c++/12.2.0/bits/stl_function.h:117:12: note: declared here
  117 |     struct unary_function
      |            ^~~~~~~~~~~~~~
In file included from /home/wzy/.cache/yay/vvc-vtm/src/VVCSoftware_VTM-VTM-14.0/source/Lib/CommonLib/Unit.h:43:
/home/wzy/.cache/yay/vvc-vtm/src/VVCSoftware_VTM-VTM-14.0/source/Lib/CommonLib/Mv.h:276:28: error: ‘template<class _Arg, class _Result> struct std::unary_function’ is deprecated [-Werror=deprecated-declarations]
  276 |   struct hash<Mv> : public unary_function<Mv, uint64_t>
      |                            ^~~~~~~~~~~~~~
/usr/include/c++/12.2.0/bits/stl_function.h:117:12: note: declared here
  117 |     struct unary_function
      |            ^~~~~~~~~~~~~~
In file included from /home/wzy/.cache/yay/vvc-vtm/src/VVCSoftware_VTM-VTM-14.0/source/Lib/CommonLib/Unit.h:42,
                 from /home/wzy/.cache/yay/vvc-vtm/src/VVCSoftware_VTM-VTM-14.0/source/Lib/CommonLib/AdaptiveLoopFilter.h:43,
                 from /home/wzy/.cache/yay/vvc-vtm/src/VVCSoftware_VTM-VTM-14.0/source/Lib/CommonLib/AdaptiveLoopFilter.cpp:38:
/home/wzy/.cache/yay/vvc-vtm/src/VVCSoftware_VTM-VTM-14.0/source/Lib/CommonLib/Common.h:150:34: error: ‘template<class _Arg, class _Result> struct std::unary_function’ is deprecated [-Werror=deprecated-declarations]
  150 |   struct hash<Position> : public unary_function<Position, uint64_t>
      |                                  ^~~~~~~~~~~~~~
In file included from /usr/include/c++/12.2.0/string:48,
                 from /usr/include/c++/12.2.0/bits/locale_classes.h:40,
                 from /usr/include/c++/12.2.0/bits/ios_base.h:41,
                 from /usr/include/c++/12.2.0/ios:42,
                 from /usr/include/c++/12.2.0/ostream:38,
                 from /usr/include/c++/12.2.0/iostream:39,
                 from /home/wzy/.cache/yay/vvc-vtm/src/VVCSoftware_VTM-VTM-14.0/source/Lib/CommonLib/CommonDef.h:42,
                 from /home/wzy/.cache/yay/vvc-vtm/src/VVCSoftware_VTM-VTM-14.0/source/Lib/CommonLib/AdaptiveLoopFilter.h:41:
/usr/include/c++/12.2.0/bits/stl_function.h:117:12: note: declared here
  117 |     struct unary_function
      |            ^~~~~~~~~~~~~~
/home/wzy/.cache/yay/vvc-vtm/src/VVCSoftware_VTM-VTM-14.0/source/Lib/CommonLib/Common.h:159:30: error: ‘template<class _Arg, class _Result> struct std::unary_function’ is deprecated [-Werror=deprecated-declarations]
  159 |   struct hash<Size> : public unary_function<Size, uint64_t>
      |                              ^~~~~~~~~~~~~~
/usr/include/c++/12.2.0/bits/stl_function.h:117:12: note: declared here
  117 |     struct unary_function
      |            ^~~~~~~~~~~~~~
In file included from /home/wzy/.cache/yay/vvc-vtm/src/VVCSoftware_VTM-VTM-14.0/source/Lib/CommonLib/Unit.h:43:
/home/wzy/.cache/yay/vvc-vtm/src/VVCSoftware_VTM-VTM-14.0/source/Lib/CommonLib/Mv.h:276:28: error: ‘template<class _Arg, class _Result> struct std::unary_function’ is deprecated [-Werror=deprecated-declarations]
  276 |   struct hash<Mv> : public unary_function<Mv, uint64_t>
      |                            ^~~~~~~~~~~~~~
/usr/include/c++/12.2.0/bits/stl_function.h:117:12: note: declared here
  117 |     struct unary_function
      |            ^~~~~~~~~~~~~~
In file included from /home/wzy/.cache/yay/vvc-vtm/src/VVCSoftware_VTM-VTM-14.0/source/Lib/CommonLib/Rom.h:42,
                 from /home/wzy/.cache/yay/vvc-vtm/src/VVCSoftware_VTM-VTM-14.0/source/Lib/CommonLib/Slice.h:46,
                 from /home/wzy/.cache/yay/vvc-vtm/src/VVCSoftware_VTM-VTM-14.0/source/Lib/CommonLib/Contexts.h:42,
                 from /home/wzy/.cache/yay/vvc-vtm/src/VVCSoftware_VTM-VTM-14.0/source/Lib/CommonLib/Contexts.cpp:38:
/home/wzy/.cache/yay/vvc-vtm/src/VVCSoftware_VTM-VTM-14.0/source/Lib/CommonLib/Common.h:150:34: error: ‘template<class _Arg, class _Result> struct std::unary_function’ is deprecated [-Werror=deprecated-declarations]
  150 |   struct hash<Position> : public unary_function<Position, uint64_t>
      |                                  ^~~~~~~~~~~~~~
In file included from /usr/include/c++/12.2.0/string:48,
                 from /usr/include/c++/12.2.0/bits/locale_classes.h:40,
                 from /usr/include/c++/12.2.0/bits/ios_base.h:41,
                 from /usr/include/c++/12.2.0/ios:42,
                 from /usr/include/c++/12.2.0/ostream:38,
                 from /usr/include/c++/12.2.0/iostream:39,
                 from /home/wzy/.cache/yay/vvc-vtm/src/VVCSoftware_VTM-VTM-14.0/source/Lib/CommonLib/CommonDef.h:42,
                 from /home/wzy/.cache/yay/vvc-vtm/src/VVCSoftware_VTM-VTM-14.0/source/Lib/CommonLib/Contexts.h:41:
/usr/include/c++/12.2.0/bits/stl_function.h:117:12: note: declared here
  117 |     struct unary_function
      |            ^~~~~~~~~~~~~~
/home/wzy/.cache/yay/vvc-vtm/src/VVCSoftware_VTM-VTM-14.0/source/Lib/CommonLib/Common.h:159:30: error: ‘template<class _Arg, class _Result> struct std::unary_function’ is deprecated [-Werror=deprecated-declarations]
  159 |   struct hash<Size> : public unary_function<Size, uint64_t>
      |                              ^~~~~~~~~~~~~~
/usr/include/c++/12.2.0/bits/stl_function.h:117:12: note: declared here
  117 |     struct unary_function
      |            ^~~~~~~~~~~~~~
In file included from /home/wzy/.cache/yay/vvc-vtm/src/VVCSoftware_VTM-VTM-14.0/source/Lib/CommonLib/Picture.h:43,
                 from /home/wzy/.cache/yay/vvc-vtm/src/VVCSoftware_VTM-VTM-14.0/source/Lib/CommonLib/CacheModel.h:41,
                 from /home/wzy/.cache/yay/vvc-vtm/src/VVCSoftware_VTM-VTM-14.0/source/Lib/CommonLib/CacheModel.cpp:48:
/home/wzy/.cache/yay/vvc-vtm/src/VVCSoftware_VTM-VTM-14.0/source/Lib/CommonLib/Common.h:150:34: error: ‘template<class _Arg, class _Result> struct std::unary_function’ is deprecated [-Werror=deprecated-declarations]
  150 |   struct hash<Position> : public unary_function<Position, uint64_t>
      |                                  ^~~~~~~~~~~~~~
In file included from /usr/include/c++/12.2.0/string:48,
                 from /usr/include/c++/12.2.0/bits/locale_classes.h:40,
                 from /usr/include/c++/12.2.0/bits/ios_base.h:41,
                 from /usr/include/c++/12.2.0/ios:42,
                 from /usr/include/c++/12.2.0/ostream:38,
                 from /usr/include/c++/12.2.0/iostream:39,
                 from /home/wzy/.cache/yay/vvc-vtm/src/VVCSoftware_VTM-VTM-14.0/source/Lib/CommonAnalyserLib/../CommonLib/../Utilities/program_options_lite.h:33,
                 from /home/wzy/.cache/yay/vvc-vtm/src/VVCSoftware_VTM-VTM-14.0/source/Lib/CommonLib/CacheModel.cpp:47:
/usr/include/c++/12.2.0/bits/stl_function.h:117:12: note: declared here
  117 |     struct unary_function
      |            ^~~~~~~~~~~~~~
In file included from /home/wzy/.cache/yay/vvc-vtm/src/VVCSoftware_VTM-VTM-14.0/source/Lib/CommonLib/Unit.h:43:
/home/wzy/.cache/yay/vvc-vtm/src/VVCSoftware_VTM-VTM-14.0/source/Lib/CommonLib/Mv.h:276:28: error: ‘template<class _Arg, class _Result> struct std::unary_function’ is deprecated [-Werror=deprecated-declarations]
  276 |   struct hash<Mv> : public unary_function<Mv, uint64_t>
      |                            ^~~~~~~~~~~~~~
/usr/include/c++/12.2.0/bits/stl_function.h:117:12: note: declared here
  117 |     struct unary_function
      |            ^~~~~~~~~~~~~~
/home/wzy/.cache/yay/vvc-vtm/src/VVCSoftware_VTM-VTM-14.0/source/Lib/CommonLib/Common.h:159:30: error: ‘template<class _Arg, class _Result> struct std::unary_function’ is deprecated [-Werror=deprecated-declarations]
  159 |   struct hash<Size> : public unary_function<Size, uint64_t>
      |                              ^~~~~~~~~~~~~~
/usr/include/c++/12.2.0/bits/stl_function.h:117:12: note: declared here
  117 |     struct unary_function
      |            ^~~~~~~~~~~~~~
In file included from /home/wzy/.cache/yay/vvc-vtm/src/VVCSoftware_VTM-VTM-14.0/source/Lib/CommonLib/Picture.h:43,
                 from /home/wzy/.cache/yay/vvc-vtm/src/VVCSoftware_VTM-VTM-14.0/source/Lib/CommonLib/CacheModel.h:41,
                 from /home/wzy/.cache/yay/vvc-vtm/src/VVCSoftware_VTM-VTM-14.0/source/Lib/CommonLib/CacheModel.cpp:48:
/home/wzy/.cache/yay/vvc-vtm/src/VVCSoftware_VTM-VTM-14.0/source/Lib/CommonLib/Common.h:150:34: error: ‘template<class _Arg, class _Result> struct std::unary_function’ is deprecated [-Werror=deprecated-declarations]
  150 |   struct hash<Position> : public unary_function<Position, uint64_t>
      |                                  ^~~~~~~~~~~~~~
In file included from /usr/include/c++/12.2.0/string:48,
                 from /usr/include/c++/12.2.0/bits/locale_classes.h:40,
                 from /usr/include/c++/12.2.0/bits/ios_base.h:41,
                 from /usr/include/c++/12.2.0/ios:42,
                 from /usr/include/c++/12.2.0/ostream:38,
                 from /usr/include/c++/12.2.0/iostream:39,
                 from /home/wzy/.cache/yay/vvc-vtm/src/VVCSoftware_VTM-VTM-14.0/source/Lib/CommonLib/../Utilities/program_options_lite.h:33,
                 from /home/wzy/.cache/yay/vvc-vtm/src/VVCSoftware_VTM-VTM-14.0/source/Lib/CommonLib/CacheModel.cpp:47:
/usr/include/c++/12.2.0/bits/stl_function.h:117:12: note: declared here
  117 |     struct unary_function
      |            ^~~~~~~~~~~~~~
/home/wzy/.cache/yay/vvc-vtm/src/VVCSoftware_VTM-VTM-14.0/source/Lib/CommonLib/Common.h:159:30: error: ‘template<class _Arg, class _Result> struct std::unary_function’ is deprecated [-Werror=deprecated-declarations]
  159 |   struct hash<Size> : public unary_function<Size, uint64_t>
      |                              ^~~~~~~~~~~~~~
/usr/include/c++/12.2.0/bits/stl_function.h:117:12: note: declared here
  117 |     struct unary_function
      |            ^~~~~~~~~~~~~~
In file included from /home/wzy/.cache/yay/vvc-vtm/src/VVCSoftware_VTM-VTM-14.0/source/Lib/CommonLib/Unit.h:43,
                 from /home/wzy/.cache/yay/vvc-vtm/src/VVCSoftware_VTM-VTM-14.0/source/Lib/CommonLib/Picture.h:44:
/home/wzy/.cache/yay/vvc-vtm/src/VVCSoftware_VTM-VTM-14.0/source/Lib/CommonLib/Mv.h:276:28: error: ‘template<class _Arg, class _Result> struct std::unary_function’ is deprecated [-Werror=deprecated-declarations]
  276 |   struct hash<Mv> : public unary_function<Mv, uint64_t>
      |                            ^~~~~~~~~~~~~~
/usr/include/c++/12.2.0/bits/stl_function.h:117:12: note: declared here
  117 |     struct unary_function
      |            ^~~~~~~~~~~~~~
In file included from /home/wzy/.cache/yay/vvc-vtm/src/VVCSoftware_VTM-VTM-14.0/source/Lib/CommonLib/Unit.h:43,
                 from /home/wzy/.cache/yay/vvc-vtm/src/VVCSoftware_VTM-VTM-14.0/source/Lib/CommonLib/Picture.h:44:
/home/wzy/.cache/yay/vvc-vtm/src/VVCSoftware_VTM-VTM-14.0/source/Lib/CommonLib/Mv.h:276:28: error: ‘template<class _Arg, class _Result> struct std::unary_function’ is deprecated [-Werror=deprecated-declarations]
  276 |   struct hash<Mv> : public unary_function<Mv, uint64_t>
      |                            ^~~~~~~~~~~~~~
/usr/include/c++/12.2.0/bits/stl_function.h:117:12: note: declared here
  117 |     struct unary_function
      |            ^~~~~~~~~~~~~~
[  9%] Building CXX object source/Lib/CommonLib/CMakeFiles/CommonLib.dir/DeblockingFilter.cpp.o
[  9%] Building CXX object source/Lib/CommonAnalyserLib/CMakeFiles/CommonAnalyserLib.dir/__/CommonLib/ContextModelling.cpp.o
In file included from /home/wzy/.cache/yay/vvc-vtm/src/VVCSoftware_VTM-VTM-14.0/source/Lib/CommonLib/../CommonLib/MotionInfo.h:43,
                 from /home/wzy/.cache/yay/vvc-vtm/src/VVCSoftware_VTM-VTM-14.0/source/Lib/CommonLib/Slice.h:55:
/home/wzy/.cache/yay/vvc-vtm/src/VVCSoftware_VTM-VTM-14.0/source/Lib/CommonLib/../CommonLib/Mv.h:276:28: error: ‘template<class _Arg, class _Result> struct std::unary_function’ is deprecated [-Werror=deprecated-declarations]
  276 |   struct hash<Mv> : public unary_function<Mv, uint64_t>
      |                            ^~~~~~~~~~~~~~
/usr/include/c++/12.2.0/bits/stl_function.h:117:12: note: declared here
  117 |     struct unary_function
      |            ^~~~~~~~~~~~~~
In file included from /home/wzy/.cache/yay/vvc-vtm/src/VVCSoftware_VTM-VTM-14.0/source/Lib/CommonLib/../CommonLib/MotionInfo.h:43,
                 from /home/wzy/.cache/yay/vvc-vtm/src/VVCSoftware_VTM-VTM-14.0/source/Lib/CommonLib/Slice.h:55,
                 from /home/wzy/.cache/yay/vvc-vtm/src/VVCSoftware_VTM-VTM-14.0/source/Lib/CommonLib/Contexts.h:42,
                 from /home/wzy/.cache/yay/vvc-vtm/src/VVCSoftware_VTM-VTM-14.0/source/Lib/CommonLib/ContextModelling.h:43:
/home/wzy/.cache/yay/vvc-vtm/src/VVCSoftware_VTM-VTM-14.0/source/Lib/CommonLib/../CommonLib/Mv.h:276:28: error: ‘template<class _Arg, class _Result> struct std::unary_function’ is deprecated [-Werror=deprecated-declarations]
  276 |   struct hash<Mv> : public unary_function<Mv, uint64_t>
      |                            ^~~~~~~~~~~~~~
/usr/include/c++/12.2.0/bits/stl_function.h:117:12: note: declared here
  117 |     struct unary_function
      |            ^~~~~~~~~~~~~~
In file included from /home/wzy/.cache/yay/vvc-vtm/src/VVCSoftware_VTM-VTM-14.0/source/Lib/CommonLib/Unit.h:42,
                 from /home/wzy/.cache/yay/vvc-vtm/src/VVCSoftware_VTM-VTM-14.0/source/Lib/CommonLib/DeblockingFilter.h:42,
                 from /home/wzy/.cache/yay/vvc-vtm/src/VVCSoftware_VTM-VTM-14.0/source/Lib/CommonLib/DeblockingFilter.cpp:38:
/home/wzy/.cache/yay/vvc-vtm/src/VVCSoftware_VTM-VTM-14.0/source/Lib/CommonLib/Common.h:150:34: error: ‘template<class _Arg, class _Result> struct std::unary_function’ is deprecated [-Werror=deprecated-declarations]
  150 |   struct hash<Position> : public unary_function<Position, uint64_t>
      |                                  ^~~~~~~~~~~~~~
In file included from /usr/include/c++/12.2.0/string:48,
                 from /usr/include/c++/12.2.0/bits/locale_classes.h:40,
                 from /usr/include/c++/12.2.0/bits/ios_base.h:41,
                 from /usr/include/c++/12.2.0/ios:42,
                 from /usr/include/c++/12.2.0/ostream:38,
                 from /usr/include/c++/12.2.0/iostream:39,
                 from /home/wzy/.cache/yay/vvc-vtm/src/VVCSoftware_VTM-VTM-14.0/source/Lib/CommonLib/CommonDef.h:42,
                 from /home/wzy/.cache/yay/vvc-vtm/src/VVCSoftware_VTM-VTM-14.0/source/Lib/CommonLib/DeblockingFilter.h:41:
/usr/include/c++/12.2.0/bits/stl_function.h:117:12: note: declared here
  117 |     struct unary_function
      |            ^~~~~~~~~~~~~~
In file included from /home/wzy/.cache/yay/vvc-vtm/src/VVCSoftware_VTM-VTM-14.0/source/Lib/CommonLib/Rom.h:42,
                 from /home/wzy/.cache/yay/vvc-vtm/src/VVCSoftware_VTM-VTM-14.0/source/Lib/CommonLib/ContextModelling.h:41,
                 from /home/wzy/.cache/yay/vvc-vtm/src/VVCSoftware_VTM-VTM-14.0/source/Lib/CommonLib/ContextModelling.cpp:38:
/home/wzy/.cache/yay/vvc-vtm/src/VVCSoftware_VTM-VTM-14.0/source/Lib/CommonLib/Common.h:150:34: error: ‘template<class _Arg, class _Result> struct std::unary_function’ is deprecated [-Werror=deprecated-declarations]
  150 |   struct hash<Position> : public unary_function<Position, uint64_t>
      |                                  ^~~~~~~~~~~~~~
/home/wzy/.cache/yay/vvc-vtm/src/VVCSoftware_VTM-VTM-14.0/source/Lib/CommonLib/Common.h:159:30: error: ‘template<class _Arg, class _Result> struct std::unary_function’ is deprecated [-Werror=deprecated-declarations]
  159 |   struct hash<Size> : public unary_function<Size, uint64_t>
      |                              ^~~~~~~~~~~~~~
In file included from /usr/include/c++/12.2.0/string:48,
                 from /usr/include/c++/12.2.0/bits/locale_classes.h:40,
                 from /usr/include/c++/12.2.0/bits/ios_base.h:41,
                 from /usr/include/c++/12.2.0/ios:42,
                 from /usr/include/c++/12.2.0/ostream:38,
                 from /usr/include/c++/12.2.0/iostream:39,
                 from /home/wzy/.cache/yay/vvc-vtm/src/VVCSoftware_VTM-VTM-14.0/source/Lib/CommonLib/CommonDef.h:42,
                 from /home/wzy/.cache/yay/vvc-vtm/src/VVCSoftware_VTM-VTM-14.0/source/Lib/CommonLib/Rom.h:41:
/usr/include/c++/12.2.0/bits/stl_function.h:117:12: note: declared here
  117 |     struct unary_function
      |            ^~~~~~~~~~~~~~
/home/wzy/.cache/yay/vvc-vtm/src/VVCSoftware_VTM-VTM-14.0/source/Lib/CommonLib/Common.h:159:30: error: ‘template<class _Arg, class _Result> struct std::unary_function’ is deprecated [-Werror=deprecated-declarations]
  159 |   struct hash<Size> : public unary_function<Size, uint64_t>
      |                              ^~~~~~~~~~~~~~
/usr/include/c++/12.2.0/bits/stl_function.h:117:12: note: declared here
  117 |     struct unary_function
      |            ^~~~~~~~~~~~~~
/usr/include/c++/12.2.0/bits/stl_function.h:117:12: note: declared here
  117 |     struct unary_function
      |            ^~~~~~~~~~~~~~
In file included from /home/wzy/.cache/yay/vvc-vtm/src/VVCSoftware_VTM-VTM-14.0/source/Lib/CommonLib/Unit.h:43:
/home/wzy/.cache/yay/vvc-vtm/src/VVCSoftware_VTM-VTM-14.0/source/Lib/CommonLib/Mv.h:276:28: error: ‘template<class _Arg, class _Result> struct std::unary_function’ is deprecated [-Werror=deprecated-declarations]
  276 |   struct hash<Mv> : public unary_function<Mv, uint64_t>
      |                            ^~~~~~~~~~~~~~
/usr/include/c++/12.2.0/bits/stl_function.h:117:12: note: declared here
  117 |     struct unary_function
      |            ^~~~~~~~~~~~~~
[  9%] Building CXX object source/Lib/CommonLib/CMakeFiles/CommonLib.dir/DepQuant.cpp.o
In file included from /home/wzy/.cache/yay/vvc-vtm/src/VVCSoftware_VTM-VTM-14.0/source/Lib/CommonAnalyserLib/../CommonLib/../CommonLib/MotionInfo.h:43,
                 from /home/wzy/.cache/yay/vvc-vtm/src/VVCSoftware_VTM-VTM-14.0/source/Lib/CommonLib/Slice.h:55,
                 from /home/wzy/.cache/yay/vvc-vtm/src/VVCSoftware_VTM-VTM-14.0/source/Lib/CommonLib/Contexts.h:42,
                 from /home/wzy/.cache/yay/vvc-vtm/src/VVCSoftware_VTM-VTM-14.0/source/Lib/CommonLib/ContextModelling.h:43:
/home/wzy/.cache/yay/vvc-vtm/src/VVCSoftware_VTM-VTM-14.0/source/Lib/CommonAnalyserLib/../CommonLib/../CommonLib/Mv.h:276:28: error: ‘template<class _Arg, class _Result> struct std::unary_function’ is deprecated [-Werror=deprecated-declarations]
  276 |   struct hash<Mv> : public unary_function<Mv, uint64_t>
      |                            ^~~~~~~~~~~~~~
/usr/include/c++/12.2.0/bits/stl_function.h:117:12: note: declared here
  117 |     struct unary_function
      |            ^~~~~~~~~~~~~~
[ 10%] Building CXX object source/Lib/CommonAnalyserLib/CMakeFiles/CommonAnalyserLib.dir/__/CommonLib/Contexts.cpp.o
cc1plus: all warnings being treated as errors
make[2]: *** [source/Lib/CommonLib/CMakeFiles/CommonLib.dir/build.make:146: source/Lib/CommonLib/CMakeFiles/CommonLib.dir/ChromaFormat.cpp.o] Error 1
make[2]: *** Waiting for unfinished jobs....
[ 10%] Building CXX object source/Lib/CommonAnalyserLib/CMakeFiles/CommonAnalyserLib.dir/__/CommonLib/DeblockingFilter.cpp.o
cc1plus: all warnings being treated as errors
make[2]: *** [source/Lib/CommonAnalyserLib/CMakeFiles/CommonAnalyserLib.dir/build.make:146: source/Lib/CommonAnalyserLib/CMakeFiles/CommonAnalyserLib.dir/__/CommonLib/ChromaFormat.cpp.o] Error 1
make[2]: *** Waiting for unfinished jobs....
cc1plus: all warnings being treated as errors
make[2]: *** [source/Lib/CommonAnalyserLib/CMakeFiles/CommonAnalyserLib.dir/build.make:132: source/Lib/CommonAnalyserLib/CMakeFiles/CommonAnalyserLib.dir/__/CommonLib/CacheModel.cpp.o] Error 1
cc1plus: all warnings being treated as errors
make[2]: *** [source/Lib/CommonLib/CMakeFiles/CommonLib.dir/build.make:132: source/Lib/CommonLib/CMakeFiles/CommonLib.dir/CacheModel.cpp.o] Error 1
In file included from /home/wzy/.cache/yay/vvc-vtm/src/VVCSoftware_VTM-VTM-14.0/source/Lib/CommonLib/Rom.h:42,
                 from /home/wzy/.cache/yay/vvc-vtm/src/VVCSoftware_VTM-VTM-14.0/source/Lib/CommonLib/Slice.h:46,
                 from /home/wzy/.cache/yay/vvc-vtm/src/VVCSoftware_VTM-VTM-14.0/source/Lib/CommonLib/Contexts.h:42,
                 from /home/wzy/.cache/yay/vvc-vtm/src/VVCSoftware_VTM-VTM-14.0/source/Lib/CommonLib/Contexts.cpp:38:
/home/wzy/.cache/yay/vvc-vtm/src/VVCSoftware_VTM-VTM-14.0/source/Lib/CommonLib/Common.h:150:34: error: ‘template<class _Arg, class _Result> struct std::unary_function’ is deprecated [-Werror=deprecated-declarations]
  150 |   struct hash<Position> : public unary_function<Position, uint64_t>
      |                                  ^~~~~~~~~~~~~~
In file included from /usr/include/c++/12.2.0/string:48,
                 from /usr/include/c++/12.2.0/bits/locale_classes.h:40,
                 from /usr/include/c++/12.2.0/bits/ios_base.h:41,
                 from /usr/include/c++/12.2.0/ios:42,
                 from /usr/include/c++/12.2.0/ostream:38,
                 from /usr/include/c++/12.2.0/iostream:39,
                 from /home/wzy/.cache/yay/vvc-vtm/src/VVCSoftware_VTM-VTM-14.0/source/Lib/CommonLib/CommonDef.h:42,
                 from /home/wzy/.cache/yay/vvc-vtm/src/VVCSoftware_VTM-VTM-14.0/source/Lib/CommonLib/Contexts.h:41:
/usr/include/c++/12.2.0/bits/stl_function.h:117:12: note: declared here
  117 |     struct unary_function
      |            ^~~~~~~~~~~~~~
/home/wzy/.cache/yay/vvc-vtm/src/VVCSoftware_VTM-VTM-14.0/source/Lib/CommonLib/Common.h:159:30: error: ‘template<class _Arg, class _Result> struct std::unary_function’ is deprecated [-Werror=deprecated-declarations]
  159 |   struct hash<Size> : public unary_function<Size, uint64_t>
      |                              ^~~~~~~~~~~~~~
/usr/include/c++/12.2.0/bits/stl_function.h:117:12: note: declared here
  117 |     struct unary_function
      |            ^~~~~~~~~~~~~~
In file included from /home/wzy/.cache/yay/vvc-vtm/src/VVCSoftware_VTM-VTM-14.0/source/Lib/CommonLib/Rom.h:42,
                 from /home/wzy/.cache/yay/vvc-vtm/src/VVCSoftware_VTM-VTM-14.0/source/Lib/CommonLib/Slice.h:46,
                 from /home/wzy/.cache/yay/vvc-vtm/src/VVCSoftware_VTM-VTM-14.0/source/Lib/CommonLib/Contexts.h:42,
                 from /home/wzy/.cache/yay/vvc-vtm/src/VVCSoftware_VTM-VTM-14.0/source/Lib/CommonLib/DepQuant.h:40,
                 from /home/wzy/.cache/yay/vvc-vtm/src/VVCSoftware_VTM-VTM-14.0/source/Lib/CommonLib/DepQuant.cpp:34:
/home/wzy/.cache/yay/vvc-vtm/src/VVCSoftware_VTM-VTM-14.0/source/Lib/CommonLib/Common.h:150:34: error: ‘template<class _Arg, class _Result> struct std::unary_function’ is deprecated [-Werror=deprecated-declarations]
  150 |   struct hash<Position> : public unary_function<Position, uint64_t>
      |                                  ^~~~~~~~~~~~~~
In file included from /usr/include/c++/12.2.0/string:48,
                 from /usr/include/c++/12.2.0/bits/locale_classes.h:40,
                 from /usr/include/c++/12.2.0/bits/ios_base.h:41,
                 from /usr/include/c++/12.2.0/ios:42,
                 from /usr/include/c++/12.2.0/ostream:38,
                 from /usr/include/c++/12.2.0/iostream:39,
                 from /home/wzy/.cache/yay/vvc-vtm/src/VVCSoftware_VTM-VTM-14.0/source/Lib/CommonLib/CommonDef.h:42,
                 from /home/wzy/.cache/yay/vvc-vtm/src/VVCSoftware_VTM-VTM-14.0/source/Lib/CommonLib/DepQuant.h:39:
/usr/include/c++/12.2.0/bits/stl_function.h:117:12: note: declared here
  117 |     struct unary_function
      |            ^~~~~~~~~~~~~~
/home/wzy/.cache/yay/vvc-vtm/src/VVCSoftware_VTM-VTM-14.0/source/Lib/CommonLib/Common.h:159:30: error: ‘template<class _Arg, class _Result> struct std::unary_function’ is deprecated [-Werror=deprecated-declarations]
  159 |   struct hash<Size> : public unary_function<Size, uint64_t>
      |                              ^~~~~~~~~~~~~~
/usr/include/c++/12.2.0/bits/stl_function.h:117:12: note: declared here
  117 |     struct unary_function
      |            ^~~~~~~~~~~~~~
In file included from /home/wzy/.cache/yay/vvc-vtm/src/VVCSoftware_VTM-VTM-14.0/source/Lib/CommonLib/Unit.h:42,
                 from /home/wzy/.cache/yay/vvc-vtm/src/VVCSoftware_VTM-VTM-14.0/source/Lib/CommonLib/DeblockingFilter.h:42,
                 from /home/wzy/.cache/yay/vvc-vtm/src/VVCSoftware_VTM-VTM-14.0/source/Lib/CommonLib/DeblockingFilter.cpp:38:
/home/wzy/.cache/yay/vvc-vtm/src/VVCSoftware_VTM-VTM-14.0/source/Lib/CommonLib/Common.h:150:34: error: ‘template<class _Arg, class _Result> struct std::unary_function’ is deprecated [-Werror=deprecated-declarations]
  150 |   struct hash<Position> : public unary_function<Position, uint64_t>
      |                                  ^~~~~~~~~~~~~~
In file included from /usr/include/c++/12.2.0/string:48,
                 from /usr/include/c++/12.2.0/bits/locale_classes.h:40,
                 from /usr/include/c++/12.2.0/bits/ios_base.h:41,
                 from /usr/include/c++/12.2.0/ios:42,
                 from /usr/include/c++/12.2.0/ostream:38,
                 from /usr/include/c++/12.2.0/iostream:39,
                 from /home/wzy/.cache/yay/vvc-vtm/src/VVCSoftware_VTM-VTM-14.0/source/Lib/CommonLib/CommonDef.h:42,
                 from /home/wzy/.cache/yay/vvc-vtm/src/VVCSoftware_VTM-VTM-14.0/source/Lib/CommonLib/DeblockingFilter.h:41:
/usr/include/c++/12.2.0/bits/stl_function.h:117:12: note: declared here
  117 |     struct unary_function
      |            ^~~~~~~~~~~~~~
/home/wzy/.cache/yay/vvc-vtm/src/VVCSoftware_VTM-VTM-14.0/source/Lib/CommonLib/Common.h:159:30: error: ‘template<class _Arg, class _Result> struct std::unary_function’ is deprecated [-Werror=deprecated-declarations]
  159 |   struct hash<Size> : public unary_function<Size, uint64_t>
      |                              ^~~~~~~~~~~~~~
/usr/include/c++/12.2.0/bits/stl_function.h:117:12: note: declared here
  117 |     struct unary_function
      |            ^~~~~~~~~~~~~~
In file included from /home/wzy/.cache/yay/vvc-vtm/src/VVCSoftware_VTM-VTM-14.0/source/Lib/CommonLib/Unit.h:43:
/home/wzy/.cache/yay/vvc-vtm/src/VVCSoftware_VTM-VTM-14.0/source/Lib/CommonLib/Mv.h:276:28: error: ‘template<class _Arg, class _Result> struct std::unary_function’ is deprecated [-Werror=deprecated-declarations]
  276 |   struct hash<Mv> : public unary_function<Mv, uint64_t>
      |                            ^~~~~~~~~~~~~~
/usr/include/c++/12.2.0/bits/stl_function.h:117:12: note: declared here
  117 |     struct unary_function
      |            ^~~~~~~~~~~~~~
In file included from /home/wzy/.cache/yay/vvc-vtm/src/VVCSoftware_VTM-VTM-14.0/source/Lib/CommonAnalyserLib/../CommonLib/../CommonLib/MotionInfo.h:43,
                 from /home/wzy/.cache/yay/vvc-vtm/src/VVCSoftware_VTM-VTM-14.0/source/Lib/CommonLib/Slice.h:55:
/home/wzy/.cache/yay/vvc-vtm/src/VVCSoftware_VTM-VTM-14.0/source/Lib/CommonAnalyserLib/../CommonLib/../CommonLib/Mv.h:276:28: error: ‘template<class _Arg, class _Result> struct std::unary_function’ is deprecated [-Werror=deprecated-declarations]
  276 |   struct hash<Mv> : public unary_function<Mv, uint64_t>
      |                            ^~~~~~~~~~~~~~
/usr/include/c++/12.2.0/bits/stl_function.h:117:12: note: declared here
  117 |     struct unary_function
      |            ^~~~~~~~~~~~~~
In file included from /home/wzy/.cache/yay/vvc-vtm/src/VVCSoftware_VTM-VTM-14.0/source/Lib/CommonLib/../CommonLib/MotionInfo.h:43,
                 from /home/wzy/.cache/yay/vvc-vtm/src/VVCSoftware_VTM-VTM-14.0/source/Lib/CommonLib/Slice.h:55:
/home/wzy/.cache/yay/vvc-vtm/src/VVCSoftware_VTM-VTM-14.0/source/Lib/CommonLib/../CommonLib/Mv.h:276:28: error: ‘template<class _Arg, class _Result> struct std::unary_function’ is deprecated [-Werror=deprecated-declarations]
  276 |   struct hash<Mv> : public unary_function<Mv, uint64_t>
      |                            ^~~~~~~~~~~~~~
/usr/include/c++/12.2.0/bits/stl_function.h:117:12: note: declared here
  117 |     struct unary_function
      |            ^~~~~~~~~~~~~~
cc1plus: all warnings being treated as errors
make[2]: *** [source/Lib/CommonLib/CMakeFiles/CommonLib.dir/build.make:174: source/Lib/CommonLib/CMakeFiles/CommonLib.dir/ContextModelling.cpp.o] Error 1
cc1plus: all warnings being treated as errors
make[2]: *** [source/Lib/CommonLib/CMakeFiles/CommonLib.dir/build.make:188: source/Lib/CommonLib/CMakeFiles/CommonLib.dir/Contexts.cpp.o] Error 1
cc1plus: all warnings being treated as errors
cc1plus: all warnings being treated as errors
make[2]: *** [source/Lib/CommonAnalyserLib/CMakeFiles/CommonAnalyserLib.dir/build.make:174: source/Lib/CommonAnalyserLib/CMakeFiles/CommonAnalyserLib.dir/__/CommonLib/ContextModelling.cpp.o] Error 1
make[2]: *** [source/Lib/CommonLib/CMakeFiles/CommonLib.dir/build.make:118: source/Lib/CommonLib/CMakeFiles/CommonLib.dir/Buffer.cpp.o] Error 1
cc1plus: all warnings being treated as errors
make[2]: *** [source/Lib/CommonAnalyserLib/CMakeFiles/CommonAnalyserLib.dir/build.make:118: source/Lib/CommonAnalyserLib/CMakeFiles/CommonAnalyserLib.dir/__/CommonLib/Buffer.cpp.o] Error 1
cc1plus: all warnings being treated as errors
make[2]: *** [source/Lib/CommonLib/CMakeFiles/CommonLib.dir/build.make:76: source/Lib/CommonLib/CMakeFiles/CommonLib.dir/AdaptiveLoopFilter.cpp.o] Error 1
cc1plus: all warnings being treated as errors
make[2]: *** [source/Lib/CommonAnalyserLib/CMakeFiles/CommonAnalyserLib.dir/build.make:188: source/Lib/CommonAnalyserLib/CMakeFiles/CommonAnalyserLib.dir/__/CommonLib/Contexts.cpp.o] Error 1
cc1plus: all warnings being treated as errors
make[2]: *** [source/Lib/CommonAnalyserLib/CMakeFiles/CommonAnalyserLib.dir/build.make:76: source/Lib/CommonAnalyserLib/CMakeFiles/CommonAnalyserLib.dir/__/CommonLib/AdaptiveLoopFilter.cpp.o] Error 1
cc1plus: all warnings being treated as errors
cc1plus: all warnings being treated as errors
cc1plus: all warnings being treated as errors
make[2]: *** [source/Lib/CommonLib/CMakeFiles/CommonLib.dir/build.make:216: source/Lib/CommonLib/CMakeFiles/CommonLib.dir/DepQuant.cpp.o] Error 1
make[2]: *** [source/Lib/CommonLib/CMakeFiles/CommonLib.dir/build.make:160: source/Lib/CommonLib/CMakeFiles/CommonLib.dir/CodingStructure.cpp.o] Error 1
make[2]: *** [source/Lib/CommonAnalyserLib/CMakeFiles/CommonAnalyserLib.dir/build.make:160: source/Lib/CommonAnalyserLib/CMakeFiles/CommonAnalyserLib.dir/__/CommonLib/CodingStructure.cpp.o] Error 1
cc1plus: all warnings being treated as errors
make[2]: *** [source/Lib/CommonLib/CMakeFiles/CommonLib.dir/build.make:202: source/Lib/CommonLib/CMakeFiles/CommonLib.dir/DeblockingFilter.cpp.o] Error 1
make[1]: *** [CMakeFiles/Makefile2:332: source/Lib/CommonLib/CMakeFiles/CommonLib.dir/all] Error 2
make[1]: *** Waiting for unfinished jobs....
cc1plus: all warnings being treated as errors
make[2]: *** [source/Lib/CommonAnalyserLib/CMakeFiles/CommonAnalyserLib.dir/build.make:202: source/Lib/CommonAnalyserLib/CMakeFiles/CommonAnalyserLib.dir/__/CommonLib/DeblockingFilter.cpp.o] Error 1
make[1]: *** [CMakeFiles/Makefile2:358: source/Lib/CommonAnalyserLib/CMakeFiles/CommonAnalyserLib.dir/all] Error 2
make: *** [Makefile:91: all] Error 2
make: *** [Makefile:104: debug] Error 1
==> ERROR: A failure occurred in build().
    Aborting...
 -> error making: vvc-vtm