Package Details: vzlogger-git r606.8324cdd-1

Git Clone URL: https://aur.archlinux.org/vzlogger-git.git (read-only)
Package Base: vzlogger-git
Description: Tool to read and log measurements of many smart meters and sensors
Upstream URL: http://wiki.volkszaehler.org/software/controller/vzlogger
Licenses: GPL
Conflicts: vzlogger
Provides: vzlogger
Submitter: asdil12
Maintainer: asdil12
Last Packager: asdil12
Votes: 1
Popularity: 0.460589
First Submitted: 2016-06-30 13:21
Last Updated: 2016-07-03 11:17

Required by (0)

Sources (1)

Latest Comments

kbabioch commented on 2017-11-06 09:06

I've reported the issues upstream, and they have been addressed. The latest git version can be compiled just fine now.

kbabioch commented on 2017-06-13 20:47

Fails to build for me:

cd /tmp/yaourt-tmp-kbabioch/aur-vzlogger-git/src/vzlogger/build/src/protocols && /usr/bin/c++ -DHAVE_CONFIG_HPP -I/tmp/yaourt-tmp-kbabioch/aur-vzlogger-git/src/vzlogger/build -I/tmp/yaourt-tmp-kbabioch/aur-vzlogger-git/src/vzlogger/include -I/tmp/yaourt-tmp-kbabioch/aur-vzlogger-git/src/vzlogger -W -Wall -Wextra -Werror -Wnon-virtual-dtor -Wno-system-headers -Winit-self -Wmissing-include-dirs -Wno-pragmas -Wredundant-decls -Wno-unused-parameter -std=c++11 -fpermissive -Wno-error=redundant-decls -Wno-ignored-qualifiers -g3 -o CMakeFiles/proto.dir/MeterFile.cpp.o -c /tmp/yaourt-tmp-kbabioch/aur-vzlogger-git/src/vzlogger/src/protocols/MeterFile.cpp
/tmp/yaourt-tmp-kbabioch/aur-vzlogger-git/src/vzlogger/src/protocols/MeterFile.cpp: In constructor 'MeterFile::MeterFile(std::__cxx11::list<Option>)':
/tmp/yaourt-tmp-kbabioch/aur-vzlogger-git/src/vzlogger/src/protocols/MeterFile.cpp:81:25: error: this statement may fall through [-Werror=implicit-fallthrough=]
scanf_format[j++] = '%'; // add double %% to escape a conversion identifier
~~~~~~~~~~~~~~~~~~^~~~~
/tmp/yaourt-tmp-kbabioch/aur-vzlogger-git/src/vzlogger/src/protocols/MeterFile.cpp:83:6: note: here
default:
^~~~~~~
cc1plus: all warnings being treated as errors
make[2]: *** [src/protocols/CMakeFiles/proto.dir/build.make:162: src/protocols/CMakeFiles/proto.dir/MeterFile.cpp.o] Error 1
make[2]: Leaving directory '/tmp/yaourt-tmp-kbabioch/aur-vzlogger-git/src/vzlogger/build'
make[1]: *** [CMakeFiles/Makefile2:1173: src/protocols/CMakeFiles/proto.dir/all] Error 2
make[1]: Leaving directory '/tmp/yaourt-tmp-kbabioch/aur-vzlogger-git/src/vzlogger/build'
make: *** [Makefile:166: all] Error 2