Package Details: waybar-git r636.67593b8-1

Git Clone URL: https://aur.archlinux.org/waybar-git.git (read-only, click to copy)
Package Base: waybar-git
Description: Highly customizable Wayland bar for Sway and Wlroots based compositors (GIT)
Upstream URL: https://github.com/Alexays/Waybar/
Keywords: bar sway wlroots
Licenses: MIT
Conflicts: waybar
Provides: waybar
Submitter: BlueGone
Maintainer: Alexays (BlueGone)
Last Packager: Alexays
Votes: 22
Popularity: 1.18
First Submitted: 2018-08-09 18:41
Last Updated: 2020-07-02 06:53

Latest Comments

1 2 3 4 Next › Last »

electricprism commented on 2020-07-20 21:08

I think a rebuild needs to be triggered on jsoncpp upgrade -- I can't recall if there is a DEPENDS in PKGBUILD for that or not, the last year I've gotten this error twice

waybar: error while loading shared libraries: libjsoncpp.so.22: cannot open shared object file: No such file or directory

Reinstalling waybar-git fixes the problem.

nhrjr commented on 2020-07-01 23:26

@Alexays: The meson.build.patch does not pass the validity check. Could you update the checksum? Thanks!

insmo commented on 2020-07-01 04:27

Thanks for updating the patch.

Xorg commented on 2020-06-12 20:10

@Alexays: can you fix the patch, please?

tfreiberg commented on 2020-05-20 07:06

Since yesterday, meson.build.patch needs to be updated. The libinput = dependency('libinput') line needs to be removed, then the patch can be applied again

rhysperry111 commented on 2020-02-26 20:42

Should gtk-layer-shell be added to optdepends?

jomority commented on 2020-01-30 19:01

@zach Yes, since the last commit (4e5d63bdeb53) this is fixed :)

zach commented on 2020-01-30 17:21

@jomority try installing with a clean build to get the dependency.

jomority commented on 2020-01-24 21:48

Build failing with error:

../waybar-git/include/modules/clock.hpp:9:10: fatal error: date/tz.h: No such file or directory
    9 | #include <date/tz.h>
      |          ^~~~~~~~~~~
compilation terminated.

I believe a dependency is missing.

alejometal commented on 2020-01-24 21:30

Failed with error:

Run-time dependency date found: NO (tried pkgconfig and cmake) Not looking for a fallback subproject for the dependency date because: Use of fallbackdependencies is disabled.

...

In file included from ../waybar-git/include/factory.hpp:4, from ../waybar-git/src/factory.cpp:1: ../waybar-git/include/modules/clock.hpp:9:10: error fatal: date/tz.h: No existe el fichero o el directorio 9 | #include <date/tz.h> | ^~~~~~~~~~~ compilación terminada.