Package Details: waybar-git r636.67593b8-1

Git Clone URL: (read-only, click to copy)
Package Base: waybar-git
Description: Highly customizable Wayland bar for Sway and Wlroots based compositors (GIT)
Upstream URL:
Keywords: bar sway wlroots
Licenses: MIT
Conflicts: waybar
Provides: waybar
Submitter: BlueGone
Maintainer: Alexays (BlueGone, maximbaz)
Last Packager: Alexays
Votes: 25
Popularity: 0.098735
First Submitted: 2018-08-09 18:41
Last Updated: 2021-11-30 14:00

Required by (16)

Sources (1)

Latest Comments

« First ‹ Previous 1 2 3 4 5 Next › Last »

jomority commented on 2020-01-24 21:48

Build failing with error:

../waybar-git/include/modules/clock.hpp:9:10: fatal error: date/tz.h: No such file or directory
    9 | #include <date/tz.h>
      |          ^~~~~~~~~~~
compilation terminated.

I believe a dependency is missing.

alejometal commented on 2020-01-24 21:30

Failed with error:

Run-time dependency date found: NO (tried pkgconfig and cmake) Not looking for a fallback subproject for the dependency date because: Use of fallbackdependencies is disabled.


In file included from ../waybar-git/include/factory.hpp:4, from ../waybar-git/src/factory.cpp:1: ../waybar-git/include/modules/clock.hpp:9:10: error fatal: date/tz.h: No existe el fichero o el directorio 9 | #include <date/tz.h> | ^~~~~~~~~~~ compilación terminada.

zach commented on 2019-12-17 06:05

Failing with error:

[72/90] Generating waybar-mpd.5 with a custom command.
FAILED: waybar-mpd.5
/usr/bin/sh -c '/usr/bin/scdoc < ../waybar-git/man/waybar-mpd.5.scd > waybar-mpd.5'
Error at 79:1: Tabs are required for indentation
[81/90] Compiling C++ object 'waybar@exe/src_modules_mpd.cpp.o'.
ninja: build stopped: subcommand failed.

Gamma commented on 2019-08-29 19:41

Add scdoc/scdoc-git as a dependency.

mnussbaum commented on 2019-05-26 18:40

There's probably not much you can do if an upstream dependency is down, but just FYI right now it looks like this package won't build due to being down

toggleton commented on 2019-04-23 11:30

==> Validating source files with sha1sums... waybar-git ... Skipped ... FAILED ==> ERROR: One or more files did not pass the validity check!

need to change the sha1sums=('SKIP' 'ec12c4c2a5af2f92f35da8d57115e01f7ecf490d')

Alexays commented on 2019-04-23 09:45

@SibrenVasse now fixed :)

SibrenVasse commented on 2019-04-23 08:50

The current patch fails to apply.

--- 2018-11-08 09:57:21.000000000 +0100
+++   2018-11-09 09:47:40.000000000 +0100
@@ -32,7 +32,7 @@

 thread_dep = dependency('threads')
 libinput = dependency('libinput')
-fmt = dependency('fmt', version : ['>=5.3.0'], fallback : ['fmt', 'fmt_dep'])
+fmt = subproject('fmt').get_variable('fmt_dep')
 wayland_client = dependency('wayland-client')
 wayland_cursor = dependency('wayland-cursor')
 wayland_protos = dependency('wayland-protocols')

Xorg commented on 2019-03-27 08:09

Please add these lines in PKGBUILD:


fmartingr commented on 2019-03-19 13:14

You may want to make this conflict with the community/waybar package, so it is uninstalled automatically (or at least warns the user).