Package Details: wesnoth-devel 1.13.4-2

Git Clone URL: https://aur.archlinux.org/wesnoth-devel.git (read-only)
Package Base: wesnoth-devel
Description: development version of a turn-based strategy game on a fantasy world
Upstream URL: http://www.wesnoth.org/
Keywords: game strategy
Licenses: GPL
Submitter: valdar
Maintainer: valdar
Last Packager: valdar
Votes: 57
Popularity: 0.036520
First Submitted: 2007-02-28 22:40
Last Updated: 2016-05-31 06:50

Dependencies (13)

Required by (0)

Sources (8)

Latest Comments

darkbasic commented on 2016-06-02 12:29

Yes, it works now.

valdar commented on 2016-05-31 06:53

@darkbasic: actually you were right: problem was gcc6 and how -isystem is interpreted there, try this new release an let me know.

valdar commented on 2016-05-31 06:52

Updated to be compatible with gcc 6.x.
Tnx to @darkbasic for reporting the error.

darkbasic commented on 2016-05-18 08:51

$ LANG=en pacaur -Ss boost
extra/boost 1.60.0-5 [installed]
Free peer-reviewed portable C++ source libraries - development headers
extra/boost-libs 1.60.0-5 [installed]
Free peer-reviewed portable C++ source libraries - runtime libraries

valdar commented on 2016-05-11 10:02

@darkbasic it seems you don't have boost version >= 1.35 ?

darkbasic commented on 2016-05-10 14:47

It doesn't compile anymore (maybe gcc 6?)

scons: Reading SConscript files ...
Building Wesnoth version 1.13.4
Mkdir("build")
---[checking prerequisites]---
Checking for C header file poll.h... yes
Checking for C header file sys/poll.h... yes
Checking for C header file sys/select.h... yes
Checking for C header file sys/sendfile.h... yes
Checking for C function sendfile()... yes
Checking for C library m... yes
Checking for C function round()... yes
Checking whether C++ compiler works (g++ version >= 3.3 required)... yes
Checking for Simple DirectMedia Layer library version >= 2.0.2... yes
Checking for SDL2_net library... yes
Checking for Boost iostreams library version >= 1.34.1... no
Checking for gzip support in Boost Iostreams... no
Checking for bzip2 support in Boost Iostreams... no
Checking for Boost random library version >= 1.40.0... no
Checking for Boost smart_ptr library... no
Checking for Boost system library... no
Checking for Boost filesystem library version >= 1.44.0... no
Checking for Boost locale library... no
WARN: Base prerequisites are not met
Checking for Simple DirectMedia Layer library version >= 2.0.2... yes
Checking for SDL2_ttf library... yes
Checking for SDL2_mixer library... yes
Checking for SDL2_image library... yes
Checking for C library vorbisfile... yes
Checking for Ogg Vorbis support in SDL... yes
Checking for PNG support in SDL... yes
Checking for JPG support in SDL... yes
Checking for C library pthread... yes
Checking for Boost system library... no
Checking for Boost asio library... no
Checking for Pango with cairo backend... (cached) yes
Checking for fontconfig... (cached) yes
Checking for Boost program_options library version >= 1.35.0... no
Checking for Boost regex library version >= 1.35.0... no
WARN: Client prerequisites are not met. wesnoth, cutter and exploder cannot be built
WARN: Unit tests are disabled because their prerequisites are not met
If any config checks fail, look in build/config.log for details
If a check fails spuriously due to caching, use --config=force to force its rerun
---[applying configuration]---
scons: done reading SConscript files.
scons: Building targets ...
error_action(["wesnoth"], [])
scons: *** [wesnoth] Target disabled because its prerequisites are not met
scons: building terminated because of errors.

valdar commented on 2016-03-11 23:21

Updated to 1.13.4

darkbasic commented on 2016-01-04 14:37

Thanks valdar!

valdar commented on 2015-12-28 21:02

Updated to 1.13.2

valdar commented on 2015-12-28 18:38

https://patch-diff.githubusercontent.com/raw/wesnoth/wesnoth/pull/565.patch

valdar commented on 2015-12-27 14:30

We are progressing in solving the issue!
Solved previous problem, found another one (in building unit tests with boost 1.60) and risen another bug: https://gna.org/bugs/?24234

Let's see how it goes.

darkbasic commented on 2015-12-27 14:09

https://github.com/wesnoth/wesnoth/commit/aa1ea043bbf52d509197eab91ab85c70e633d69e this commit didn't help: http://pastebin.com/iPX5UYhj

valdar commented on 2015-12-27 13:55

https://gist.github.com/anonymous/0115aa6a7856a66fa3ff

valdar commented on 2015-12-27 13:10

https://github.com/wesnoth/wesnoth/commit/aa1ea043bbf52d509197eab91ab85c70e633d69e.patch

valdar commented on 2015-12-27 12:52

@darkbasic: I think the damn answer is "clone". Regarding the interesting chat you have quoted, when do they plan to release those changes?

darkbasic commented on 2015-12-26 09:08

[14:25] <celticminstrel> darkbasic: I think I get the problem.
[14:25] <loonycyborg> seems like new boost bug or something?
[14:25] <celticminstrel> boost::none_t is not meant to be constructed. Maybe they decided to enforce it to be a singleton in Boost 1.60.
[14:26] <loonycyborg> the latest boost version I used is 1,59
[14:26] <celticminstrel> You're supposed to use boost::none.
[14:26] <celticminstrel> I just changed it and am making sure it still compiles.
[14:28] <celticminstrel> (I'm sure it will though.)
[14:29] <vultraz> I should upgrade my build to boost 1.60 too
[14:30] <celticminstrel> I think the XCode builds are still using 1.54.
[14:31] <vultraz> : o
[14:31] <celticminstrel> ANd I think I have 1.58 installed on my system.
[14:31] <celticminstrel> ^And
[14:45] <celticminstrel> I wonder if that affects 1.12.4(?) too.

darkbasic commented on 2015-12-25 12:22

They are idiot... https://gna.org/support/?3279

"What Git command do you use to duplicate a sheep?"

What's the damn answer?

valdar commented on 2015-12-24 15:51

@darkbasic:
reported a bug on the upstream project:
https://gna.org/bugs/index.php?24227

let's see how it goes; not much time to dig in to it by myself.

darkbasic commented on 2015-12-22 11:12

When trying to compile 1.13.1 I get:

In file included from src/tests/gui/test_save_dialog.cpp:33:0:
src/tests/utils/auto_parameterized.hpp:44:62: error: no matching function for call to ‘make_test_case(void (*)(const SDLKey&), boost::unit_test::const_string, SDLKey*&, SDLKey*&)’
BOOST_JOIN(test_name, _begin), BOOST_JOIN(test_name, _end))); \

The same if I manually bump the pkgbuild to 1.13.2.

darkbasic commented on 2015-12-21 12:33

Please bump to 1.13.2
Thanks :)

valdar commented on 2015-08-24 17:58

Updated to 1.13.1

sorry for the delay :/

valdar commented on 2015-04-20 12:53

Updated to 1.13.0

valdar commented on 2014-11-10 17:43

Updated to 1.11.19

valdar commented on 2014-10-26 18:16

Updated to 1.11.18

valdar commented on 2014-10-14 11:37

Updated to 1.11.17

no boost patch need anymore

einsiedlerkrebs commented on 2014-10-13 14:53

md5sum wesnoth-1.11.17.tar.bz2
7fb94158acec98cbc930cb6146f5cb89

cockatricehunter commented on 2014-10-12 18:40

@valdar. Works like a charm.

Thanks

valdar commented on 2014-10-12 13:46

Uploaded to support latest boost releae (1.56.0)

@cockatricehunter
can you try this new version and let me know?

cockatricehunter commented on 2014-10-03 23:32

@valdar
boost 1.56.0-1
icu 53.1-1

valdar commented on 2014-10-03 23:15

@cockatricehunter
Can you give me the exact icu and boost version that you are using?
Anyway, I'm away from my arch machines till next saturday... I'll look in to it ASAP.

cockatricehunter commented on 2014-10-03 22:46

After a recent boost and icu update wesnoth-devel no longer works. While downgrading boost is fine, downgrading icu affects other programs (ex. firefox). Normally I would try to reinstall/re-compile but this time I came across this error:

g++ -o wesnoth -pthread -Wl,-O1,--sort-common,--as-needed,-z,relro build/release/game.o build/release/libwesnoth_extras.a build/release/lua/liblua.a build/release/libwesnoth_core.a build/release/libwesnoth_sdl.a build/release/libwesnoth.a build/release/libwesnoth_extras.a build/release/lua/liblua.a -L/usr/lib -lm -lboost_iostreams -lSDL -lSDL_net -lpthread -lboost_system -lpangocairo-1.0 -lpango-1.0 -lgobject-2.0 -lcairo -lfontconfig -lfreetype -lboost_program_options -lboost_regex -lSDL_ttf -lSDL_mixer -lvorbisfile -lSDL_image -lX11 -ldbus-1 -lfribidi -lglib-2.0
build/release/libwesnoth_extras.a(multiplayer_connect_engine.o): In function `mp::connect_engine::start_game_commandline(commandline_options const&)':
multiplayer_connect_engine.cpp:(.text+0xd7c9): undefined reference to `std::basic_ostream<char, std::char_traits<char> >& boost::operator<< <char, std::char_traits<char>, std::string>(std::basic_ostream<char, std::char_traits<char> >&, boost::optional<std::string> const&)'
collect2: error: ld returned 1 exit status
scons: *** [wesnoth] Error 1
scons: building terminated because of errors.

Any ideas? Is there a way to build this so that boost updates don't break this?
Thanks

valdar commented on 2014-07-17 18:00

Updated to 1.11.16

valdar commented on 2014-06-30 08:05

@TrialnError

ok I try what you suggested!

valdar commented on 2014-06-13 07:43

@TrialnError

Yep!
That does make sense, at first glance.
I overlooked the difference beetween /run/wesnothd and /var/run/wesnothd.
I'll figure out how to set the fifodir in scons building and update the package afther that.

Thank you!

TrialnError commented on 2014-06-12 15:42

One thing. I looked into the case with /var/run. Luckily there was a bugreport which I could use as a stepstone.

/var/run is a symlink to /run which is a tmpfs.

So, you added wesnothd-devel.tmpfiles.conf which points to /run.
In the PKGBuild the fifodir should be reflect this. See the change the [community] package made[0].
So the chmod part could be nuked, the fifodir should be changed and a .install file be added if I see it correctly.
________
[0]https://projects.archlinux.org/svntogit/community.git/commit/trunk?h=packages/wesnoth&id=1ca53ec31ea0f4a426fcb801d0ab3bac7abb8caa

valdar commented on 2014-06-11 22:23

Updated as TrialnError suggested.

Let me know if there are some problems.

valdar commented on 2014-06-09 07:14

@TrialnError:

Regarding the patching part: Yes, is should be removed completely. It was needed for a couple of old version.

I'll review and update the PKGBuild following your suggestions as soon as possible.

Thankyou for all the infos!

TrialnError commented on 2014-06-06 19:36

Forget to add:
Although I moved the commented part into prepare(). The patch it mentions isn't included. So should it be removed completly, or not?

TrialnError commented on 2014-06-06 19:32

Here is a PKGBuild where I made changes that were necessary (at least I think)
https://gist.github.com/Narrat/4c217b1b5aea79a00d85

\ in source isn't needed anymore. The same for the |return 1 statements
Any sort of patching should be done in prepare().
Some of deps are only needed buildtime and some weren't needed.
Gettext for example is in the group base/base-devel. And since base-devel is required for AUR it's not necessary to list it in depends.
And I removed ruby, as I couldn't find any reference to it (lua, yes, python yes, but no ruby)

Still I suggest to use the PKGBuild from [community] stable wesnoth to look into necessary changes or chances (for example the .service file for the server, configs).

Still not sure about this "fifodir=/var/run/wesnothd-devel" Namcap complains about it.

valdar commented on 2014-05-27 19:53

Upgraded to 1.11.15

As usual thanks @einsiedlerkrebs !

einsiedlerkrebs commented on 2014-05-27 17:40

md5sum 1.11.15
d21a63ca364b3579f1b487b8d0a1b817

thank you for updating.

valdar commented on 2014-04-25 19:11

Upgraded to 1.11.13

@einsiedlerkrebs:
Thank you!

einsiedlerkrebs commented on 2014-04-25 10:01

md5sum 1.11.13
f7278074dc8f886b1954863efd1f382a

thank you for updating.

valdar commented on 2014-04-01 18:53

Upgraded to 1.11.12

@einsiedlerkrebs:
Thank you!

einsiedlerkrebs commented on 2014-03-31 21:08

md5sum for 1.11.12 is
a008e036cd29d4c8ed037725b93d7904

einsiedlerkrebs commented on 2014-03-31 20:46

new versions md5sum is:
a008e036cd29d4c8ed037725b93d7904

valdar commented on 2014-03-17 22:41

Upgraded to 1.11.11

macxcool commented on 2014-03-17 13:24

@valdar
Yes. "Underneath the radar" is the usual phrase. I like the unusual though ;-)

valdar commented on 2014-03-17 13:15

@macxcool
Ehhehe, are you sping my wrong comments? :)
Anyway I think that underneath is more appropriate, isn't it?

macxcool commented on 2014-03-17 12:32

Above your radar works fine too. Either way it wouldn't be onscreen ;-)

valdar commented on 2014-03-17 08:14

@Rudanar , @Xiaoming94

I'm sorry!
This update went underneath my radar!
I'll update as soon as possible: i.e. this evening.

valdar commented on 2014-03-17 08:09

@Rudanar , @Xiaoming94

I'm sorry!
This update went above my radar!
I'll update as soon as possible: i.e. this evening.

Rudanar commented on 2014-03-15 17:29

An update would be appreciated for beta testing.

Xiaoming94 commented on 2014-03-15 08:23

@valdar

Sure not thinking about updating the package?

Xiaoming94 commented on 2014-02-12 12:36

@valdar

Forgot to tell you, Removed the entire folder where the PKGBUILD was stored and redownloaded the tarball.

And then it was build succéssfully, Dunno why O.o

valdar commented on 2014-02-05 19:06

@Xiaoming94
just re-compiled with your very same version of boost;
I can't reproduce your problem.

May be you can try to uninstal and re-install the boost package?

valdar commented on 2014-01-31 08:20

@Xiaoming94
Yep, probably.
I'll try to build with your version of boost and let you know.

Xiaoming94 commented on 2014-01-30 22:10

Shouldn't be any problems, Guess something's odd with the new Boost libries?

Xiaoming94 commented on 2014-01-30 22:06

It Just returns
"boost 1.55.0-4"

valdar commented on 2014-01-30 21:22

@Xiaoming94
I have just revised the dependencies;
can you try to rebuild this version?

Your problem seems releted to the boost library version;
what does "pacman -Q boost" return?

Xiaoming94 commented on 2014-01-30 18:27

Checking for gzip support in Boost Iostreams... (cached) no
Base prerequisites are not met.
Client prerequisites are not met. wesnoth, cutter and exploder cannot be built.
Unit tests are disabled because their prerequisites are not met.
If any config checks fail, look in build/config.log for details
If a check fails spuriously due to caching, use --config=force to force its rerun
error: No repo or cache detected.
scons: done reading SConscript files.
scons: Building targets ...
error_action(["wesnoth"], [])
scons: *** [wesnoth] Target disabled because its prerequisites are not met
scons: building terminated because of errors.
==> ERROR: A failure occurred in build().
Aborting...

Strange... How to fix it?

Xiaoming94 commented on 2014-01-30 17:45

Client prerequisites are not met. wesnoth, cutter and exploder cannot be built.
Unit tests are disabled because their prerequisites are not met.
If any config checks fail, look in build/config.log for details
If a check fails spuriously due to caching, use --config=force to force its rerun
error: No repo or cache detected.
scons: done reading SConscript files.
scons: Building targets ...
error_action(["wesnoth"], [])
scons: *** [wesnoth] Target disabled because its prerequisites are not met
scons: building terminated because of errors.
==> ERROR: A failure occurred in build().
Aborting...

How to fix?

valdar commented on 2014-01-09 22:44

Updated to 1.11.8

valdar commented on 2013-11-18 22:25

Updated to 1.11.7

valdar commented on 2013-09-30 20:40

Updated to 1.11.6

valdar commented on 2013-09-29 16:33

Ok, I'm going to update the PKGBUILD ASAP.

mindkeep commented on 2013-09-29 06:26

1.11.6 is available. updating PKGBUILD version and md5 sum seems to work without issue.

valdar commented on 2013-05-26 21:50

Updated to 1.11.4

valdar commented on 2013-04-21 16:07

Updated to 1.11.2

marcinfa commented on 2013-01-29 12:07

wesnoth-devel: error while loading shared libraries: libboost_iostreams.so.1.50.0: cannot open shared object file: No such file or directory - boost-libs 1.52 not work with this package.

marcinfa commented on 2013-01-29 12:06

wesnoth-devel: error while loading shared libraries: libboost_iostreams.so.1.50.0: cannot open shared object file: No such file or directory -boost-libs 1.52 not work with this build only 1.50

valdar commented on 2012-12-28 18:37

Updated to 1.11.1

Anonymous comment on 2012-09-03 09:34

@valdar:
Works! Thanks!

valdar commented on 2012-09-02 15:14

Updated to 1.11.0

@mr.bos:
Try this new pakgbuild and let me know.

emericn6k commented on 2012-09-01 08:18

Hello
A new dev branch (1.11.x) has been released (I haven't had time to try compiling yet).

Anonymous comment on 2012-08-23 05:32

Don't build with boost 1.50.0-2:

In file included from src/addon/manager.cpp:22:0:
src/foreach.hpp:9:22: error: ‘boost::BOOST_FOREACH’ has not been declared
scons: *** [build/release/addon/manager.o] Error 1
scons: building terminated because of errors.

valdar commented on 2012-01-30 08:32

@diffycat:

The 1.10 wesnoth release is a stable release so the outdated package is wesnoth in [Extra];
this package is for development releases (as the suffix "-devel" suggests).

valdar commented on 2012-01-13 15:05

@macxcool:

Yep.
When the 1.10 is out it is going to be the new stable release,
so is the package in Extra that will needs update.

macxcool commented on 2012-01-13 13:13

Just wondering, but is the 1.10 version going to be the new version in 'Extra' when it's released?

valdar commented on 2012-01-11 21:49

Updated to 1.9.14 aka 1.10-rc1

valdar commented on 2011-12-24 22:51

Updated to 1.9.13

valdar commented on 2011-12-12 23:13

Updated to 1.9.12

valdar commented on 2011-11-26 16:06

Updated to 1.9.11

valdar commented on 2011-11-12 16:55

Updated to 1.9.10

Anonymous comment on 2011-11-11 16:33

http://sourceforge.net/projects/wesnoth/files/wesnoth/wesnoth-1.9.10/
Wesnoth 1.9.10 is out

valdar commented on 2011-09-16 20:04

Updated to 1.9.9

ReNoM commented on 2011-09-07 06:20

http://sourceforge.net/projects/wesnoth/files/wesnoth/wesnoth-1.9.9/
Wesnoth 1.9.9 is out.

valdar commented on 2011-08-19 09:39

Updated as suggested in order to compile the package also for x86_64 architecture.

valdar commented on 2011-08-19 09:39

Updated as suggested in order to compile the package also for x86_64 architecture.

valdar commented on 2011-08-14 18:24

I am in holidays right now, I'll upgrade the PKGBUILD as soon as possible...

Raziel23 commented on 2011-08-11 10:04

Here is my working PKGBUILD with this compile patch:
http://pastebin.com/d2iL0a0q

I haven't changed the patch file at all, I applied it as it is.

Trieforce commented on 2011-08-10 12:32

can u show me your PKGBUILd pls

macxcool commented on 2011-08-09 13:11

I used the patch as-is and everything worked. Thanks Calamulus.

Anonymous comment on 2011-08-09 03:36

Ah yes, I should have confirmed that I also compiled 1.9.8 with that patch. I just changed 1.8.6 occurrences to 1.9.8 so paths get properly matched and it works.

Anonymous comment on 2011-08-08 13:34

I can confirm that the patch (https://bugzilla.redhat.com/attachment.cgi?id=514578) helped me compile 1.9.8. Without the patch the compilation fails (see macxcool's comment).

macxcool commented on 2011-08-08 13:13

That patch seems to be against version 1.8.6. Does it apply here?

Anonymous comment on 2011-08-04 23:04

Alright, it is a bug originated from a Boost rebase due to a GCC change. Details:
http://gna.org/bugs/?18399 (Wesnoth bug report)
https://bugzilla.redhat.com/show_bug.cgi?id=724818 (Redhat bug report and patch)
https://svn.boost.org/trac/boost/ticket/5279 (Boost change).

There is a patch that we might use while this gets sorted (if it even does), posted on redhat: https://bugzilla.redhat.com/attachment.cgi?id=514578

Cheers.

Anonymous comment on 2011-08-04 22:20

I'm also getting the same error, on x86_64. Skimming through the error I think it might be something from the Boost library and the noncopyable class. I'll ask on the wesnoth forums.

macxcool commented on 2011-08-04 13:19

I'm getting scons errors when building:
http://pastebin.com/v2mBRSAH

macxcool commented on 2011-08-04 12:48

I'm getting scons errors when building:
http://pastebin.com/v2mBRSAH

valdar commented on 2011-08-03 21:40

Upgraded to version 1.9.8

valdar commented on 2011-08-03 21:40

Upgraded to version 1.9.8

TZ86 commented on 2011-08-03 12:44

1.9.8 is out

http://forums.wesnoth.org/viewtopic.php?t=34562

valdar commented on 2011-07-03 23:02

Upgraded to version 1.9.7

valdar commented on 2011-07-03 23:02

Upgraded to version 1.9.7

valdar commented on 2011-06-12 13:09

@matthewbauer
If you mean the map editor try the new 1.9.6-2 package and let me know.

valdar commented on 2011-06-12 13:09

@matthewbauer
If you mean the map editor try the new 1.9.6-2 package and let me know.

matthewbauer commented on 2011-06-11 19:57

The .desktop file for the editor doesn't work for me. Where is the binary for the editor in Wesnoth devel?

valdar commented on 2011-05-15 18:06

Upgraded to version 1.9.6

Issue with wesnothd-devel remains :/

valdar commented on 2011-05-15 18:06

Upgraded to version 1.9.6

Issue with wesnothd-devel remains :/

macxcool commented on 2011-04-11 13:51

Does it make any sense to maybe have wesnoth and wesnothd as two separate packages?

macxcool commented on 2011-04-09 19:53

running wesnothd-devel gives me:
wesnothd-devel: malloc.c:3096: sYSMALLOc: Assertion `(old_top == (((mbinptr) (((char *) &((av)->bins[((1) - 1) * 2])) - __builtin_offsetof (struct malloc_chunk, fd)))) && old_size == 0) || ((unsigned long) (old_size) >= (unsigned long)((((__builtin_offsetof (struct malloc_chunk, fd_nextsize))+((2 * (sizeof(size_t))) - 1)) & ~((2 * (sizeof(size_t))) - 1))) && ((old_top)->size & 0x1) && ((unsigned long)old_end & pagemask) == 0)' failed.
Aborted

Anonymous comment on 2011-04-07 14:06

boost 1.46.0-4
boost-libs 1.46.0-4

macxcool commented on 2011-04-07 12:46

What version of boost and boost-libs are you running?
I have 1.46.0-4

macxcool commented on 2011-04-07 12:43

gzip 1.4-2

Anonymous comment on 2011-04-06 23:51

gzip 1.4-2

valdar commented on 2011-04-06 21:05

Can you post the output of:

pacman -Q | grep gzip

tnx!

valdar commented on 2011-04-06 20:39

Can you post the output of:

pacman -Q | grep gzip

tnx!

valdar commented on 2011-04-06 19:58

Can you post the output of:

pacman -Q | grep gzip

tnx!

macxcool commented on 2011-04-05 16:41

I compiled it just fine. I've had no problems with this or previous -devel versions.

Anonymous comment on 2011-04-05 10:41

I'm getting an error

Checking for gzip support in Boost Iostreams... no
Base prerequisites are not met.

was anyone able to compile this?

valdar commented on 2011-04-03 20:27

Upgraded to version 1.9.5

Anonymous comment on 2011-03-29 19:07

@valdar

According following text I have this library installed.
-------------------------------------------------------
pacman -Q | grep sdl
sdl 1.2.14-6
sdl_image 1.2.10-2
sdl_mixer 1.2.11-2
sdl_net 1.2.7-3
sdl_ttf 2.0.10-1

valdar commented on 2011-03-29 17:54

@mrl586

It seems that you don't have SDL library version 1.2.7 or greater installed...

macxcool commented on 2011-03-22 12:37

No problem building either .1 or .2

Anonymous comment on 2011-03-21 18:55

I tried it again and I got following error:
---------------------------------------------------------------------------------------------------
UnicodeDecodeError: 'ascii' codec can't decode byte 0xc3 in position 34: ordinal not in range(128):
File "/tmp/packerbuild-1000/wesnoth-devel/wesnoth-devel/src/wesnoth-1.9.4/SConstruct", line 293:
conf.CheckSDL(require_version = '1.2.7') and \
File "/usr/lib/python2.7/site-packages/SCons/SConf.py", line 640:
ret = self.test(context, *args, **kw)
File "./scons/sdl.py", line 33:
env.ParseConfig(foo_config)
File "/usr/lib/python2.7/site-packages/SCons/Environment.py", line 1460:
return function(self, self.backtick(command))
File "/usr/lib/python2.7/site-packages/SCons/Environment.py", line 591:
sys.stderr.write(unicode(err))
Checking for Simple DirectMedia Layer library version >= 1.2.7... ==> VIRHE: Virhe tapahtui kohdassa build().
Peruutetaan...
The build failed.
------------------------------------------------------------------------------------------------------------

valdar commented on 2011-03-17 19:48

@mrl586:
Try this new update and let me know.

Anonymous comment on 2011-03-17 08:27

I got following error when I try compile this package:
---------------------------------------------------------------------------------------------------
UnicodeDecodeError: 'ascii' codec can't decode byte 0xc3 in position 34: ordinal not in range(128):
File "/tmp/yaourt-tmp-user/aur-wesnoth-devel/src/wesnoth-1.9.4/SConstruct", line 293:
conf.CheckSDL(require_version = '1.2.7') and \
File "/usr/lib/python2.7/site-packages/SCons/SConf.py", line 640:
ret = self.test(context, *args, **kw)
File "./scons/sdl.py", line 33:
env.ParseConfig(foo_config)
File "/usr/lib/python2.7/site-packages/SCons/Environment.py", line 1460:
return function(self, self.backtick(command))
File "/usr/lib/python2.7/site-packages/SCons/Environment.py", line 591:
sys.stderr.write(unicode(err))
Checking for Simple DirectMedia Layer library version >= 1.2.7...
---------------------------------------------------------------------------------------------

valdar commented on 2011-02-08 20:26

Upgraded to version 1.9.4

New build method with scons; please report any issue!

valdar commented on 2010-12-11 20:02

Upgraded to version 1.9.3

valdar commented on 2010-11-29 11:22

Upgraded to version 1.9.2

emericn6k commented on 2010-11-26 19:18

Hi,

I've modified the PKGBUILD for version 1.9.2.

http://paste.opensuse.org/19509013

(and oh, yes, i need to see how to make KDE pastebin plasmoid use aur.pastebin.com instead of other distros pastebins...)

Rudanar commented on 2010-11-08 22:26

Version 1.9.2 is available. Thank you in advance.

Rudanar commented on 2010-11-08 22:25

Version 1.9.2 is available. Tank you.

valdar commented on 2010-09-24 08:06

Changed as vcap and emericn6k suggested.

[sometimes I forget namcap, fogive me! :P]

vcap commented on 2010-09-24 00:58

As noted by emericn6k, you can remove lua from the dependencies (they are now using an in-tree version[1]).

Also, you can drop all the '|| return 1'; current makepkg does it automatically.


[1] btw, namcap could have told you.

valdar commented on 2010-09-23 01:07

Updated to version 1.9.1
[many tnx to clmates]
[sorry for the delay]

feufochmar commented on 2010-09-18 11:01

Version 1.9.1 is available.

valdar commented on 2010-08-29 20:37

I will look at this package next week when I'll be back home.

emericn6k commented on 2010-08-24 17:08

@clmates: With your pkgbuild, it failed once (don't know why).
So I read wesnoth forum thread and found that lua dependency could be deleted.

=> a pkgbuild that worked for me is : http://aur.pastebin.com/CT2TL3h2

Anonymous comment on 2010-08-23 19:20

Hi I have adapted the PKGBUILD and it seems to work with 1.9.0

changes:

Adapted the version and release
Adapted the md5sum for the new 1.9 file
Commented out the patch file, md5 of patch file and patch instructions

here are my changed PKGBUILD


#Contributor:Andrea Tarocchi <valdar@email.it>
pkgname=wesnoth-devel
pkgver=1.9.0
pkgrel=1
pkgdesc="development version of a turn-based strategy game on a fantasy world"
arch=('i686' 'x86_64')
url="http://www.wesnoth.org/"
license=('GPL')
depends=('lua' 'pango' 'sdl_ttf' 'sdl_net' 'sdl_mixer' 'sdl_image' 'boost' 'fribidi' 'ruby' 'dbus-core')
install=${pkgname}.install
source=(http://downloads.sourceforge.net/sourceforge/wesnoth/wesnoth-$pkgver.tar.bz2 \
${pkgname}.desktop \
wesnoth_editor-devel.desktop \
wesnoth-devel-icon.xpm \
wesnoth-devel_editor-icon.xpm)
md5sums=('c4e7ba80c6212cb58c3ff96d10f417ae'
'a906eae5d541a51de77038469b1f794b'
'36c3cbe51dedaa07d2f16b35338664a5'
'b73f4fdefd3e7daa158cce278f11be64'
'931e7443fe37b2862ca59f65ded74a0b')

build() {

#CONFIGURING
cd "${srcdir}/wesnoth-$pkgver"
./autogen.sh || return 1
./configure --prefix=/usr --enable-tools --enable-editor --enable-server \
--with-preferences-dir=.wesnoth-devel --program-suffix=-devel --with-datadir-name=wesnoth-devel \
--enable-campaign-server --with-fifodir=/var/run/wesnothd-devel --docdir=/usr/share/doc/wesnoth-devel \
--mandir=/usr/share/man/wesnoth-devel || return 1
#--disable-strict-compilation || return 1

#PATCHING for libpng compatibility
#cd ..
#patch -p0 < ../libpng_compatibility_patch.patch || return 1

#MAKING datarootdir=/usr/share datadir=/usr/share || return 1 might be another useful otion
cd "${srcdir}/wesnoth-$pkgver"
make || return 1

# make pkgpythondir=${pkgdir}/usr/lib/python`python -c \
# "import sys; print '%d' % (sys.version_info[0]);" \
# `.`python -c "import sys; print '%d' % (sys.version_info[1]);" \
# `/site-packages/wesnoth DESTDIR="${pkgdir}" install || return 1

make DESTDIR="${pkgdir}" install || return 1

#INSTALLING of menu entry and icons:
install -D -m644 ../../wesnoth-devel.desktop ${pkgdir}/usr/share/applications/wesnoth-devel.desktop
install -D -m644 ../../wesnoth-devel-icon.xpm ${pkgdir}/usr/share/pixmaps/wesnoth-devel-icon.xpm
install -D -m644 ../../wesnoth-devel-icon.xpm ${pkgdir}/usr/share/icons/wesnoth-devel-icon.xpm

install -D -m644 ../../wesnoth_editor-devel.desktop ${pkgdir}/usr/share/applications/wesnoth_editor-devel.desktop
install -D -m644 ../../wesnoth-devel_editor-icon.xpm ${pkgdir}/usr/share/pixmaps/wesnoth-devel_editor-icon.xpm
install -D -m644 ../../wesnoth-devel_editor-icon.xpm ${pkgdir}/usr/share/icons/wesnoth-devel_editor-icon.xpm

chmod +x ${pkgdir}/var/run/wesnothd-devel
chmod o+r ${pkgdir}/var/run/wesnothd-devel

rm -f ${pkgdir}/usr/share/applications/wesnoth.desktop
rm -f ${pkgdir}/usr/share/applications/wesnoth_editor.desktop
rm -f ${pkgdir}/usr/share/icons/wesnoth-icon.png
rm -f ${pkgdir}/usr/share/icons/wesnoth_editor-icon.png
}

feufochmar commented on 2010-08-21 14:24

1.9.0 development version is available.

valdar commented on 2010-08-05 08:58

wesnoth 1.8 is the latest stable release not the development one!

valdar commented on 2010-04-03 23:48

wesnoth 1.8 is the latest stable release not the development one!