Package Details: x2goclient-git 4.0.5.1.r16.g128d498-1

Git Clone URL: https://aur.archlinux.org/x2goclient-git.git (read-only)
Package Base: x2goclient-git
Description: x2go qt4 client
Upstream URL: http://www.x2go.org/
Licenses: GPL
Conflicts: x2goclient
Provides: x2goclient
Submitter: None
Maintainer: eolianoe
Last Packager: eolianoe
Votes: 4
Popularity: 0.314508
First Submitted: 2011-07-24 16:34
Last Updated: 2016-05-05 10:37

Latest Comments

msx commented on 2012-12-06 14:04

Just dropping by to thank you for packaging this gem.
x2go is a much needed project that it's taking a lot of attention and hopefully will become the GNU/Linux standard for remote desktop control.

Thorleif commented on 2012-03-13 18:58

@mastero23 It works ! Thank you.

Anonymous comment on 2012-03-13 17:57

@Thorleif Please try the new PKGBUILD, which doesn't create the html pages

Thorleif commented on 2012-03-13 16:27

Can't build the new version.

It's blocked after :

make -f Makefile.man2html build
make[1]: Entering directory `/tmp/yaourt-tmp-antoine/aur-x2goclient-git/src/x2goclient-build'
mkdir -p .build_man2html/html
for man_page in `cd man && find * -type f`; do mkdir -p `dirname .build_man2html/html/$man_page`; done
for man_page in `cd man && find * -type f`; do man2html man/$man_page > .build_man2html/html/$man_page.html; done

Thorleif commented on 2012-03-13 16:22

Can't build the new version.

It's blocked after :

make -f Makefile.man2html build
make[1]: Entering directory `/tmp/yaourt-tmp-antoine/aur-x2goclient-git/src/x2goclient-build'
mkdir -p .build_man2html/html
for man_page in `cd man && find * -type f`; do mkdir -p `dirname .build_man2html/html/$man_page`; done
for man_page in `cd man && find * -type f`; do man2html man/$man_page > .build_man2html/html/$man_page.html; done

Anonymous comment on 2011-10-29 08:17

@gimli: fixed

Anonymous comment on 2011-10-28 08:28

man2html depency is missing

Anonymous comment on 2011-09-16 16:29

@tomato: should build again

Tomato commented on 2011-09-14 11:18

Can't build:

In file included from ../printprocess.cpp:20:0:
../cupsprint.h:54:3: error: ‘ppd_file_t’ does not name a type
make[1]: *** [printprocess.o] Error 1
make[1]: *** Waiting for unfinished jobs....
In file included from ../cupsprint.cpp:12:0:
../cupsprint.h:54:3: error: ‘ppd_file_t’ does not name a type
../cupsprint.cpp: In constructor ‘CUPSPrint::CUPSPrint()’:
../cupsprint.cpp:19:2: error: ‘ppd’ was not declared in this scope
../cupsprint.cpp: In destructor ‘CUPSPrint::~CUPSPrint()’:
../cupsprint.cpp:27:7: error: ‘ppd’ was not declared in this scope