Package Details: xpaint 2.9.10.3-2

Git Clone URL: https://aur.archlinux.org/xpaint.git (read-only)
Package Base: xpaint
Description: A color image editing tool which features most standard paint program options.
Upstream URL: http://sourceforge.net/projects/sf-xpaint/
Licenses: GPL
Submitter: erm67
Maintainer: bidulock
Last Packager: bidulock
Votes: 34
Popularity: 0.024229
First Submitted: 2007-09-06 10:06
Last Updated: 2015-12-15 21:54

Latest Comments

haawda commented on 2014-07-07 17:37

sortenoscia: Please do not give bad advices. The only correct answer to PieterGen's issue was that given by bidulock.

sortenoscia commented on 2014-07-07 16:38

Download
http://downloads.sourceforge.net/sourceforge/sf-xpaint/xpaint-2.9.10.2.tar.bz2
extract
./configure
make
make install
xpaint
an go stable

bidulock commented on 2014-06-26 10:42

That's not it not building: that's you not having installed the packages necessary to build it.

PieterGen commented on 2014-06-26 10:16

Doesn't build
==> Missing dependencies:
-> libxaw3dxft
-> libpgf
==> Checking buildtime dependencies...
==> ERROR: Could not resolve all dependencies.

bidulock commented on 2014-06-17 22:56

You must have something wrong. I do:

[brian@habeascorpus ~]$ pacman -Qo /usr/lib/pkgconfig/libxaw3dxft.pc
/usr/lib/pkgconfig/libxaw3dxft.pc is owned by libxaw3dxft 1:1.6.2c-1

acampbell commented on 2014-06-17 11:50

I can't compile this. I get:

P -MF .deps/fontOp.Tpo -c -o fontOp.o fontOp.c
Package libxaw3dxft was not found in the pkg-config search path.
Perhaps you should add the directory containing `libxaw3dxft.pc'
to the PKG_CONFIG_PATH environment variable
No package 'libxaw3dxft' found
In file included from fontOp.c:30:0:
/usr/include/X11/Xft/Xft.h:39:22: fatal error: ft2build.h: No such file or directory
#include <ft2build.h>

Compilation terminated

I have installed the latest libxaw3dxft although I can't see libxaw3dxf.pc anywhere.


^

bidulock commented on 2014-04-21 20:51

2.9.10.2-1 is still putting its app defaults in /etc/X11/app-defaults instead of /usr/share/X11/app-defaults

kfgz commented on 2014-04-08 19:19

Strange. I had older version (1.6.2.b) of libxaw3dxft. After upgrade to 1.6.2c problem is fixed. Thx.

bidulock commented on 2014-04-07 11:31

Desktop file is at https://gist.github.com/bbidulock/10018613

bidulock commented on 2014-04-06 16:50

xpaint is placing its app-defaults files in /etc/X11/app-defaults: this should be changed to /usr/share/X11/app-defaults.

haawda commented on 2014-04-05 14:45

You can use a paste service for the desktop file.

kfgz, cannot confirm, builds again fine here. Maybe you need the newest version of libxawxft.

bidulock commented on 2014-04-05 04:51

Can't send mail to you email address.

bidulock commented on 2014-04-04 23:53

I sent you a src package with a much better xpaint.desktop file.

kfgz commented on 2014-04-04 14:46

Package doesn't compile

No package 'libxaw3dxft' found
fileBrowser.c: In function 'buildBrowser':
fileBrowser.c:1338:8: error: 'XtNcolorSwitch' undeclared (first use in this function)
XtNcolorSwitch, (arg->browserType==BROWSER_LOADED)?NULL:ColorSwitch,
^
fileBrowser.c:1338:8: note: each undeclared identifier is reported only once for each function it appears in
fileBrowser.c: In function 'createLXPCallback':
fileBrowser.c:1073:5: warning: ignoring return value of 'system', declared with attribute warn_unused_result [-Wunused-result]
(void) system(buf);
^
fileBrowser.c: In function 'buildBrowser':
fileBrowser.c:1278:5: warning: ignoring return value of 'getcwd', declared with attribute warn_unused_result [-Wunused-result]
(void) getcwd(arg->dirname, sizeof(arg->dirname));
^
fileBrowser.c: In function 'dotCallback':
fileBrowser.c:939:5: warning: ignoring return value of 'getcwd', declared with attribute warn_unused_result [-Wunused-result]
(void) getcwd(arg->dirname, MAX_PATH);
^
fileBrowser.c: In function 'doDirname':
fileBrowser.c:466:2: warning: ignoring return value of 'getcwd', declared with attribute warn_unused_result [-Wunused-result]
(void) getcwd(newPath, sizeof(newPath));
^
Makefile:472: recipe for target 'fileBrowser.o' failed
make[2]: *** [fileBrowser.o] Error 1
make[2]: Leaving directory '/tmp/yaourt-tmp-root/aur-xpaint/src/xpaint-2.9.10'
Makefile:535: recipe for target 'all-recursive' failed
make[1]: *** [all-recursive] Error 1
make[1]: Leaving directory '/tmp/yaourt-tmp-root/aur-xpaint/src/xpaint-2.9.10'
Makefile:335: recipe for target 'all' failed
make: *** [all] Error 2

haawda commented on 2014-04-03 13:54

Please try to add

options=("!makeflags")

to the PKGBUILD.

neitsab commented on 2014-04-02 13:14

Fails to build on my system :
"...
echo "#define XPAINT_VERSION \"2.9.9\"" > version.h
./substads -single xpaint.1.in xpaint.1 XPAINT_VERSION 2.9.9
make: ./substads: Command not found
Makefile:1038: recipe for target 'xpaint.1' failed
make: *** [xpaint.1] Error 127
make: *** Waiting for unfinished jobs....
==> ERROR: A failure occurred in build().
Aborting...
"

Any idea? Should I report this upstream ?

bidulock commented on 2013-12-27 12:39

Can't find freetype2 headers anymore. Add following to build():

sed -i 's,freetype2/freetype,freetype2,g' configure

haawda commented on 2013-03-22 21:22

removed .png-extension in desktop file's Icon entry.

haawda commented on 2013-01-28 20:18

Update, needs libxaw3dxft 1.6.2b.

haawda commented on 2012-03-04 23:32

Fails to build for me in 2.9.9.1, see

https://sourceforge.net/tracker/?func=detail&atid=503458&aid=3496870&group_id=63290

haawda commented on 2011-10-14 19:27

Update

haawda commented on 2011-04-04 19:32

Hm, builds here without that option. But I added it.

kfgz commented on 2011-04-04 19:20

Solution: add options=(!makeflags) to PKGBUILD.

kfgz commented on 2011-04-04 19:18

xpaint doesn't compile

make includes
gcc substads.c -o substads
./substads -ad2c DefaultRC DefaultRC.txt.h
/bin/sh: ./substads: No such file or directory
make: *** [DefaultRC.txt.h] Error 1
make: *** Waiting for unfinished jobs....
cd app-defaults ; ../substads -appdefs XPAINT_VERSION 2.9.8 XPAINT_SHAREDIR /usr/share/xpaint XPAINT_PRINT_COMMAND "lpr" XPAINT_POSTSCRIPT_VIEWER "gv" XPAINT_EXTERN_VIEWER "display"
Converting XPaint_fr.ad.in -> out/XPaint_fr
Converting XPaint.ad.in -> out/XPaint
Converting XPaint_es.ad.in -> out/XPaint_es
cp -p app-defaults/out/XPaint XPaint.ad
==> ERROR: A failure occurred in build().
Aborting...

haawda commented on 2010-12-04 18:27

No, both belong to base-devel.

twall commented on 2010-12-04 15:14

missing dependencies:

flex
bison

please add.