Package Details: yacreaderlibraryserver 9.8.2-1

Git Clone URL: https://aur.archlinux.org/yacreader.git (read-only, click to copy)
Package Base: yacreader
Description: Headless YACReaderLibrary server for use with YACReader for iOS.
Upstream URL: http://www.yacreader.com
Keywords: cbr cbz comic pdf reader
Licenses: GPL3
Conflicts: yacreader-bin, yacreader-git, yacreaderlibraryserver-standalone
Submitter: selmf
Maintainer: selmf
Last Packager: selmf
Votes: 35
Popularity: 2.15
First Submitted: 2014-07-06 15:35
Last Updated: 2021-06-20 07:38

Pinned Comments

selmf commented on 2021-05-24 11:17

Important: If you are having troubles compiling or launching YACReader and libicuuc is part of the error message, you need to rebuild libpdfium!

Latest Comments

1 2 3 4 5 Next › Last »

zxcv commented on 2021-05-29 13:32

There seem to be some problem with linking:

linking YACReader
/usr/bin/ld: /usr/lib/libQt5Core.so: undefined reference to `std::__exception_ptr::exception_ptr::_M_release()@CXXABI_1.3.13'
/usr/bin/ld: /usr/lib/libQt5Widgets.so: undefined reference to `std::__throw_bad_array_new_length()@GLIBCXX_3.4.29'
/usr/bin/ld: /usr/lib/libQt5Core.so: undefined reference to `std::__exception_ptr::exception_ptr::_M_addref()@CXXABI_1.3.13'
collect2: error: ld returned 1 exit status

The workaround I found was to rebuild qt5-base and qt5-declarative (get pkgfile using asp and build locally). It seems those two packages have not been rebuild with newer gcc yet.

txtsd commented on 2021-05-24 15:01

You're right. It worked.

selmf commented on 2021-05-24 11:17

Important: If you are having troubles compiling or launching YACReader and libicuuc is part of the error message, you need to rebuild libpdfium!

txtsd commented on 2021-05-24 06:10

linking YACReaderLibraryServer
/usr/bin/ld: warning: libicuuc.so.68, needed by /usr/lib/gcc/x86_64-pc-linux-gnu/11.1.0/../../../../lib/libpdfium.so, not found (try using -rpath or -rpath-link)
/usr/bin/ld: /usr/lib/gcc/x86_64-pc-linux-gnu/11.1.0/../../../../lib/libpdfium.so: undefined reference to `u_isspace_68'
/usr/bin/ld: /usr/lib/gcc/x86_64-pc-linux-gnu/11.1.0/../../../../lib/libpdfium.so: undefined reference to `u_isalnum_68'
/usr/bin/ld: /usr/lib/gcc/x86_64-pc-linux-gnu/11.1.0/../../../../lib/libpdfium.so: undefined reference to `u_isalpha_68'
/usr/bin/ld: /usr/lib/gcc/x86_64-pc-linux-gnu/11.1.0/../../../../lib/libpdfium.so: undefined reference to `u_tolower_68'
/usr/bin/ld: /usr/lib/gcc/x86_64-pc-linux-gnu/11.1.0/../../../../lib/libpdfium.so: undefined reference to `u_toupper_68'
collect2: error: ld returned 1 exit status
make[1]: *** [Makefile:724: YACReaderLibraryServer] Error 1
make[1]: Leaving directory '/home/txtsd/.cache/yay/yacreader/src/yacreader-9.8.0.2105165/YACReaderLibraryServer'
make: *** [Makefile:99: sub-YACReaderLibraryServer-make_first] Error 2
==> ERROR: A failure occurred in build().
    Aborting...
error making: yacreader

rodneyck commented on 2021-05-19 14:23

With the latest update, I am getting the following error message;

Required dependency libpdfium was not found in AUR nor in the repositories. It might be a package database synchronization problem. Operation cancelled.

Edit to add: I installed libpdfium-nojs, but it still was looking for 'libpdfium'.

wallace11 commented on 2021-05-17 13:35

Missing dependency: qt5-svg

selmf commented on 2020-01-12 08:35

@jamesburg your libpdfium-nojs package is built against an older version of the icu package. Rebuild it and it should work again.

jamesburg commented on 2020-01-12 04:43

I'm getting these errors when I try to build and install:

/usr/bin/ld: warning: libicuuc.so.64, needed by /usr/lib/gcc/x86_64-pc-linux-gnu/9.2.0/../../../../lib/libpdfium.so, not found (try using -rpath or -rpath-link)

/usr/bin/ld: /usr/lib/gcc/x86_64-pc-linux-gnu/9.2.0/../../../../lib/libpdfium.so: undefined reference to `u_isalnum_64'

/usr/bin/ld: /usr/lib/gcc/x86_64-pc-linux-gnu/9.2.0/../../../../lib/libpdfium.so: undefined reference to `u_isalpha_64'

/usr/bin/ld: /usr/lib/gcc/x86_64-pc-linux-gnu/9.2.0/../../../../lib/libpdfium.so: undefined reference to `u_isspace_64'

/usr/bin/ld: /usr/lib/gcc/x86_64-pc-linux-gnu/9.2.0/../../../../lib/libpdfium.so: undefined reference to `u_tolower_64'

/usr/bin/ld: /usr/lib/gcc/x86_64-pc-linux-gnu/9.2.0/../../../../lib/libpdfium.so: undefined reference to `u_toupper_64'

collect2: error: ld returned 1 exit status

Anonymous comment on 2020-01-11 06:16

Thank you very much!

archont commented on 2019-10-04 13:06

Download, build, install: everything working fine. Thank you very much!