Package Details: yad 0.36.3-1

Git Clone URL: https://aur.archlinux.org/yad.git (read-only)
Package Base: yad
Description: A fork of zenity - display graphical dialogs from shell scripts or command line
Upstream URL: http://sourceforge.net/projects/yad-dialog
Licenses: GPL3
Submitter: None
Maintainer: Stebalien
Last Packager: Stebalien
Votes: 92
Popularity: 3.033992
First Submitted: 2009-12-02 18:25
Last Updated: 2016-06-21 17:42

Latest Comments

Stebalien commented on 2016-02-18 16:47

You need to install the base-devel package group. All PKGBUILDs assume these packages are installed.

vyachkonovalov commented on 2016-02-18 05:36

I've got
> configure: error: no acceptable C compiler found in $PATH
So, gcc is missing make dependency

Stebalien commented on 2015-11-14 16:19

@drxspace, FYI, you can flag the package out of date.

drxspace commented on 2015-11-14 15:25

I see that the current package version out is 0.31.3
Thanks

ninian commented on 2015-05-24 23:33

@Stebalien: Many thanks for fixing this so quickly. I will bear in mind your clang modification when other PKGBUILDs seem to fail in the same way.

ninian commented on 2015-05-24 23:32

@Stebalien: Many thanks for fixing this so quickly. There is another package which seems to be failing in a similar way, so your clang modification will probably be needed there too.

Stebalien commented on 2015-05-24 23:24

@ninian, thanks. I fixed it by tricking yad into thinking we're building with clang...

ninian commented on 2015-05-24 22:57

Using fully upgraded 64-bit system (and gcc 5.1.0-4), the PKGBUILD fails for me with the following errors:
....
make all-recursive
make[1]: Entering directory '/tmp/yad/src/yad-0.28.1'
Making all in src
make[2]: Entering directory '/tmp/yad/src/yad-0.28.1/src'
CCLD yad
yad-icons.o: In function `handle_stdin':
icons.c:(.text+0x2e2): undefined reference to `strip_new_line'
yad-list.o: In function `handle_stdin':
list.c:(.text+0xe83): undefined reference to `strip_new_line'
yad-notification.o: In function `handle_stdin':
notification.c:(.text+0x563): undefined reference to `strip_new_line'
collect2: error: ld returned 1 exit status
Makefile:410: recipe for target 'yad' failed
make[2]: *** [yad] Error 1
make[2]: Leaving directory '/tmp/yad/src/yad-0.28.1/src'
Makefile:396: recipe for target 'all-recursive' failed
make[1]: *** [all-recursive] Error 1
make[1]: Leaving directory '/tmp/yad/src/yad-0.28.1'
Makefile:337: recipe for target 'all' failed
make: *** [all] Error 2
==> ERROR: A failure occurred in build().
Aborting...

Stebalien commented on 2015-04-03 14:26

davidva,
I'd rather not. It requires gtk2 (this yad package uses gtk3) and webkitgtk2 (a 43MB dependency for a 0.5MB package). If you want html support, consider uploading a yad-html package.

davidva commented on 2015-04-03 08:30

Please enable html support. I modified the PKBUILD for all.
http://fpaste.org/206852/

All comments