Package Details: yate 5.5.0-1

Git Clone URL: https://aur.archlinux.org/yate.git (read-only)
Package Base: yate
Description: Next-generation telephony engine
Upstream URL: http://yate.null.ro
Licenses: GPL
Submitter: None
Maintainer: yuvadm
Last Packager: yuvadm
Votes: 32
Popularity: 0.149780
First Submitted: 2007-04-27 18:41
Last Updated: 2015-06-30 12:52

Latest Comments

freaknils commented on 2016-06-20 16:50

This package does not contain a systemd service file. Please add this by using

install -D -m644 "${srcdir}/${pkgname}/packing/rpm/yate.service" "${pkgdir}/usr/lib/systemd/system/yate.service"

in package() function in your PKGBUILD.

carlo commented on 2014-08-25 11:42

I've created package "yate-qt4": https://aur.archlinux.org/packages/yate-qt4/
It contains only the Qt4 client, not the server. It's based on the most recent version, 5.4.0.

billyburly commented on 2014-01-14 17:26

I'm using the PKGBUILD and supporting files from chakra: https://gitorious.org/chakra-packages/apps/source/5d6a8f82abb8b33607eea083584a35c6a7ea717d:yate

They updated it to v5 and added systemd support. When I was building it, I removed the qt dependency.

gwarokk commented on 2013-10-24 18:45

Version 5 out

mukhametshin commented on 2012-05-10 11:33

The build() fails:
......
mkdir -p server && g++ -Wall -I.. -I.. -march=core2 -msse4.1 -O2 -pipe -fstack-protector --param=ssp-buffer-size=4 -D_FORTIFY_SOURCE=2 -fno-check-new -fno-exceptions -fPIC -DHAVE_GCC_FORMAT_CHECK -DHAVE_BLOCK_RETURN -export-dynamic -shared -Wl,--unresolved-symbols=ignore-in-shared-libs -Wl,--retain-symbols-file,/dev/null -Wl,--hash-style=gnu -o server/mysqldb.yate -I/usr/include/mysql -DMYSQL_OPT_RECONNECT=MYSQL_OPT_RECONNECT -DMYSQL_OPT_READ_TIMEOUT=MYSQL_OPT_READ_TIMEOUT -DMYSQL_OPT_WRITE_TIMEOUT=MYSQL_OPT_WRITE_TIMEOUT -DHAVE_MYSQL_SET_CHARSET server/mysqldb.cpp -L/usr/lib -lmysqlclient_r -lpthread -lz -lm -lrt -lssl -lcrypto -ldl -L.. -lyate
/tmp/ccitX1Vz.o: In function `(anonymous namespace)::MyModule::initialize()':
mysqldb.cpp:(.text+0x1f6d): undefined reference to `TelEngine::NamedList::getIntValue(TelEngine::String const&, int, int, int, bool) const'
mysqldb.cpp:(.text+0x20d3): undefined reference to `TelEngine::NamedList::getIntValue(TelEngine::String const&, int, int, int, bool) const'
mysqldb.cpp:(.text+0x21cd): undefined reference to `TelEngine::NamedList::getIntValue(TelEngine::String const&, int, int, int, bool) const'
mysqldb.cpp:(.text+0x2260): undefined reference to `TelEngine::NamedList::getIntValue(TelEngine::String const&, int, int, int, bool) const'
mysqldb.cpp:(.text+0x2327): undefined reference to `TelEngine::Configuration::getIntValue(TelEngine::String const&, TelEngine::String const&, int, int, int, bool) const'
collect2: ошибка: выполнение ld завершилось с кодом возврата 1
make[1]: *** [server/mysqldb.yate] Ошибка 1
make[1]: Выход из каталога `/tmp/yaourt-tmp-user/aur-yate/src/yate/modules'
make: *** [modules] Ошибка 2
==> ОШИБКА: Произошел сбой в build().
Преждевременный выход...
==> ERROR: Makepkg was unable to build yate.

mukhametshin commented on 2012-05-10 11:31

The build() fails:
......
mkdir -p server && g++ -Wall -I.. -I.. -march=core2 -msse4.1 -O2 -pipe -fstack-protector --param=ssp-buffer-size=4 -D_FORTIFY_SOURCE=2 -fno-check-new -fno-exceptions -fPIC -DHAVE_GCC_FORMAT_CHECK -DHAVE_BLOCK_RETURN -export-dynamic -shared -Wl,--unresolved-symbols=ignore-in-shared-libs -Wl,--retain-symbols-file,/dev/null -Wl,--hash-style=gnu -o server/mysqldb.yate -I/usr/include/mysql -DMYSQL_OPT_RECONNECT=MYSQL_OPT_RECONNECT -DMYSQL_OPT_READ_TIMEOUT=MYSQL_OPT_READ_TIMEOUT -DMYSQL_OPT_WRITE_TIMEOUT=MYSQL_OPT_WRITE_TIMEOUT -DHAVE_MYSQL_SET_CHARSET server/mysqldb.cpp -L/usr/lib -lmysqlclient_r -lpthread -lz -lm -lrt -lssl -lcrypto -ldl -L.. -lyate
/tmp/ccitX1Vz.o: In function `(anonymous namespace)::MyModule::initialize()':
mysqldb.cpp:(.text+0x1f6d): undefined reference to `TelEngine::NamedList::getIntValue(TelEngine::String const&, int, int, int, bool) const'
mysqldb.cpp:(.text+0x20d3): undefined reference to `TelEngine::NamedList::getIntValue(TelEngine::String const&, int, int, int, bool) const'
mysqldb.cpp:(.text+0x21cd): undefined reference to `TelEngine::NamedList::getIntValue(TelEngine::String const&, int, int, int, bool) const'
mysqldb.cpp:(.text+0x2260): undefined reference to `TelEngine::NamedList::getIntValue(TelEngine::String const&, int, int, int, bool) const'
mysqldb.cpp:(.text+0x2327): undefined reference to `TelEngine::Configuration::getIntValue(TelEngine::String const&, TelEngine::String const&, int, int, int, bool) const'
collect2: ошибка: выполнение ld завершилось с кодом возврата 1
make[1]: *** [server/mysqldb.yate] Ошибка 1
make[1]: Выход из каталога `/tmp/yaourt-tmp-flym/aur-yate/src/yate/modules'
make: *** [modules] Ошибка 2
==> ОШИБКА: Произошел сбой в build().
Преждевременный выход...
==> ERROR: Makepkg was unable to build yate.

gst commented on 2012-04-23 00:04

Yate version 4 is available

said commented on 2011-05-17 22:35

http://pastebin.com/PLKufpgy

gst commented on 2011-02-06 18:13

3.1 is available

idupree commented on 2011-01-20 07:00

The md5sum is wrong (they released yate3 -- and uploaded the new tarball to the same URL, sadly).

All comments