Package Details: zathura-pdf-mupdf-git 0.3.0.3.gbdf48aa-1

Git Clone URL: https://aur.archlinux.org/zathura-pdf-mupdf-git.git (read-only)
Package Base: zathura-pdf-mupdf-git
Description: PDF support for zathura by using the mupdf library
Upstream URL: http://pwmt.org/projects/zathura-pdf-mupdf
Licenses: custom
Conflicts: zathura-pdf-mupdf
Provides: zathura-pdf-mupdf
Submitter: None
Maintainer: mlq
Last Packager: mlq
Votes: 22
Popularity: 0.000032
First Submitted: 2011-04-29 17:13
Last Updated: 2016-10-16 09:37

Dependencies (3)

Required by (1)

Sources (1)

Latest Comments

wangru commented on 2016-10-16 13:08

Please add jbig2dec to the dependencies

caleb commented on 2016-10-15 21:27

The missing dependency on libmupdf was noted 4 months ago. Can you please update this package? If you don't want to maintain it or want help fell free to add me as a maintainer.

ale1ster commented on 2016-06-08 21:23

Missing dependency: community/libmupdf

aminb commented on 2016-04-27 16:14

The package doesn't build anymore with mupdf >= 1.9, due to some api changes.

Please either update upstream or add a patch file like zathura-pdf-mupdf in the 'community' repo does:
https://projects.archlinux.org/svntogit/community.git/tree/trunk/mupdf-1.9.patch?h=packages/zathura-pdf-mupdf

misc commented on 2014-06-26 18:02

Comma in the depends line is illegal. (Also, the ">=1.4" makes it annoying to build with mupdf-git. Not an error ofc.)

ale1ster commented on 2014-04-19 12:18

With mupdf version 1.4-2, it doesn't build anymore, breaking with the following error:

/usr/bin/ld: cannot find -lmupdf-js-none
collect2: error: ld returned 1 exit status
Makefile:50: revipe for target pdf.so failed

With a 'pacman -Ql mupdf' it seems to be due to the fact that mupdf's js library in this version is "mujs.a".
So substituting "mupdf-js-none" for "mujs" in config.mk builds successfully.

rakyi commented on 2014-01-16 17:23

Currently missing 'openjpeg2' as dependency.

TrialnError commented on 2012-08-20 18:19

After the mupdf 1.1 release this plugin doesn't build.


In file included from /usr/include/muxps.h:4:0,
from pdf.c:7:
/usr/include/fitz.h:225:3: error: unknown type name 'sigjmp_buf'
pdf.c: In function 'pdf_page_init':
pdf.c:191:3: warning: implicit declaration of function 'sigsetjmp' [-Wimplicit-function-declaration]
make: *** [pdf.o] Error 1
==> ERROR: A failure occurred in build().
Aborting...

Earnest commented on 2012-05-28 01:32

Yup, still not building.
A bunch of errors from pdf.c "error: unknown type name" and fitz.h

Reproduction is quite easy; git clone and make.

TrialnError commented on 2012-05-22 17:39

What about this plugin? It doesn't compile anymore. At least for me.

complaining about a missing file

All comments