Package Base Details: citra-git

Git Clone URL: (read-only, click to copy)
Submitter: ceri
Maintainer: timschumi
Last Packager: timschumi
Votes: 47
Popularity: 0.44
First Submitted: 2014-05-01 08:32
Last Updated: 2020-04-14 15:12

Packages (2)

Latest Comments

« First ‹ Previous 1 2 3 4 5 6 Next › Last »

timschumi commented on 2020-01-08 10:44

@dnandha I'm pretty sure that the flag is already set...

dnandha commented on 2020-01-08 06:00

Missing audio (e.g. for Pokemon X/Y) can be fixed by adding an additional compiler flag to PKGBUILD: @@ -40,6 +40,7 @@ build() { cmake .. \ -DCMAKE_INSTALL_PREFIX=/usr \ -DCMAKE_BUILD_TYPE=Release \ + -DENABLE_FFMPEG_AUDIO_DECODER=ON \ -DUSE_SYSTEM_CURL=ON make } Tested, works! Reference:

rharish commented on 2019-12-20 11:36

Citra isn't built with the AAC decoder, which leads to missing audio for Pokemon X/Y, as mentioned here. I've tried to do it myself, but it doesn't work. Could you look into this issue?.

Haystack commented on 2019-08-08 16:54

Build is failing for me (using aurutils)

[  3%] Building CXX object externals/dynarmic/src/CMakeFiles/dynarmic.dir/common/fp/fused.cpp.o
In file included from /build/citra-git/src/citra/externals/dynarmic/src/./common/assert.h:9,
                 from /build/citra-git/src/citra/externals/dynarmic/src/common/fp/fused.cpp:7:
/build/citra-git/src/citra/externals/fmt/include/fmt/format.h:3475:55: error: ISO C++ did not adopt string literal operator templates taking an argument pack of characters [-Wpedantic]
 3475 | FMT_CONSTEXPR internal::udl_formatter<Char, CHARS...> operator""_format() {
      |                                                       ^~~~~~~~
compilation terminated due to -Wfatal-errors.
make[2]: *** [externals/dynarmic/src/CMakeFiles/dynarmic.dir/build.make:102: externals/dynarmic/src/CMakeFiles/dynarmic.dir/common/fp/fused.cpp.o] Error 1
make[1]: *** [CMakeFiles/Makefile2:235: externals/dynarmic/src/CMakeFiles/dynarmic.dir/all] Error 2
make: *** [Makefile:141: all] Error 2
==> ERROR: A failure occurred in build().
==> ERROR: Build failed, check /var/lib/aurbuild/x86_64/aurpkgs/build

EDIT: Adding export CXXFLAGS+=" -DFMT_USE_USER_DEFINED_LITERALS=0" in the build section of the PKGBUILD fixed it. I got this from

Mymaud commented on 2018-10-01 19:16


that work for me, thanks.

PirateJonno commented on 2018-09-29 20:50

Just add -DCMAKE_INSTALL_LIBDIR=lib to prevent pacman from complaining

timschumi commented on 2018-09-29 08:37

The installation issue is fixed, the symlink /usr/lib64 on the filesystem conflicted with the file /usr/lib64/ that the package tried to install.

Discord integration has to wait for another time.

YamashitaRen commented on 2018-09-28 15:20

Same issue here, using makepkg + pacman -U : erreur : la validation de la transaction a échoué (conflit de fichiers) citra-qt-git : /usr/lib64 est déjà présent dans le système de fichiers (appartenant à filesystem)

gee commented on 2018-09-28 02:51

Discord integration seems to conflict with Dolphin's.

tomKPZ commented on 2018-09-28 02:19

Experiencing the same issue as @gourdcaptain. Using aurman.