Package Base Details: citra-git

Git Clone URL: (read-only, click to copy)
Submitter: ceri
Maintainer: timschumi
Last Packager: timschumi
Votes: 47
Popularity: 0.50
First Submitted: 2014-05-01 08:32
Last Updated: 2020-04-14 15:12

Packages (2)

Latest Comments

« First ‹ Previous 1 2 3 4 5 6 Next › Last »

linkmauve commented on 2017-11-02 12:59

-git packages don’t need to be updated on AUR unless there is a build change, `makepkg` will always pull first and build the very latest commit.

NY152 commented on 2017-11-02 12:08

For me it is not a problem of compilation but seniority compared to the official site.


Chez moi ce n'est pas un soucis de compilation mais d'ancienneté par rapport au site officiel.

linkmauve commented on 2017-11-01 15:46

Do you have any issue with it? I just built this package and it worked just fine.

NY152 commented on 2017-11-01 15:02

This package is no longer maintained?

Ce paquet n'est plus maintenu ?

ibrokemypie commented on 2017-08-03 12:05

not building for me...

Scanning dependencies of target dynarmic
[ 27%] Building CXX object externals/dynarmic/src/CMakeFiles/dynarmic.dir/common/memory_pool.cpp.o
[ 27%] Building CXX object externals/dynarmic/src/CMakeFiles/dynarmic.dir/frontend/arm/types.cpp.o
[ 27%] Building CXX object externals/dynarmic/src/CMakeFiles/dynarmic.dir/frontend/disassembler/disassembler_arm.cpp.o
In file included from /tmp/makepkg/citra-git/src/citra/externals/dynarmic/src/frontend/disassembler/disassembler_arm.cpp:16:0:
/tmp/makepkg/citra-git/src/citra/externals/dynarmic/src/./frontend/decoder/arm.h:324:1: error: ‘boost’ does not name a type; did you mean ‘bool’?
boost::optional<const ArmMatcher<V>&> DecodeArm(u32 instruction) {
compilation terminated due to -Wfatal-errors.
make[2]: *** [externals/dynarmic/src/CMakeFiles/dynarmic.dir/build.make:111: externals/dynarmic/src/CMakeFiles/dynarmic.dir/frontend/disassembler/disassembler_arm.cpp.o] Error 1
make[1]: *** [CMakeFiles/Makefile2:219: externals/dynarmic/src/CMakeFiles/dynarmic.dir/all] Error 2
make: *** [Makefile:141: all] Error 2
==> ERROR: A failure occurred in build().
:: failed to build citra-qt-git package(s)

linkmauve commented on 2017-07-16 21:50

I pushed a new PKGBUILD fixing these issues for me, it will be usable once is merged.

Thanks for the report!

punkrockguy318 commented on 2017-07-16 18:12

This is currently failing to build for me - I believe a few submodules are not being retrieved (a 'git submodule update --init --recursive' solved the issue for me)

linkmauve commented on 2016-07-30 15:55

Hi wyre, Pokémon doesn’t work yet, try some other game then.

wyre commented on 2016-07-25 08:09

linkmauve, thank you! the issue is getting better, however ... I still having some issues, maybe should I open an issue in Github:

PS: I've disabled JIT from settings and setup my region in EUR. And ... Is not there any 3DS alternative emulator without JIT?

linkmauve commented on 2016-07-23 16:17

Hi wyre, I fixed your issue upstream, see:

It should allow Citra to run on your computer, but without the JIT of course (so don’t expect any playable performances).