Package Base Details: freetype2-infinality

Git Clone URL: (read-only, click to copy)
Submitter: None
Maintainer: SolarAquarion
Last Packager: SolarAquarion
Votes: 469
Popularity: 0.001282
First Submitted: 2010-07-14 15:27
Last Updated: 2019-05-28 15:57

Latest Comments

« First ‹ Previous 1 2 3 4 5 6 7 8 9 10 11 ... Next › Last »

nTia89 commented on 2017-01-07 21:22

Actually I am with packages from bohoomill repo.
I decided to switch to AUR one.
Compiling this package I get this error and the compilation process stops:
/usr/lib/gcc/x86_64-pc-linux-gnu/6.2.1/../../../../lib/ undefined reference to `FT_Get_Var_Blend_Coordinates'
collect2: error: ld returned 1 exit status
make: *** [Makefile:471: /tmp/yaourt-tmp-mattia/aur-freetype2-infinality/src/ft2demos-2.7/bin/ftbench] Error 1
/usr/lib/gcc/x86_64-pc-linux-gnu/6.2.1/../../../../lib/ undefined reference to `FT_Get_Var_Blend_Coordinates'
collect2: error: ld returned 1 exit status
make: *** [Makefile:489: /tmp/yaourt-tmp-mattia/aur-freetype2-infinality/src/ft2demos-2.7/bin/ftdump] Error 1
/usr/lib/gcc/x86_64-pc-linux-gnu/6.2.1/../../../../lib/ undefined reference to `FT_Get_Var_Blend_Coordinates'
collect2: error: ld returned 1 exit status
make: *** [Makefile:468: /tmp/yaourt-tmp-mattia/aur-freetype2-infinality/src/ft2demos-2.7/bin/ftlint] Error 1
/usr/lib/gcc/x86_64-pc-linux-gnu/6.2.1/../../../../lib/ undefined reference to `FT_Get_Var_Blend_Coordinates'
collect2: error: ld returned 1 exit status
make: *** [Makefile:504: /tmp/yaourt-tmp-mattia/aur-freetype2-infinality/src/ft2demos-2.7/bin/ttdebug] Error 1

Any suggestion?

lowsky commented on 2016-12-30 04:01

The PGP issue is one annoying problem. Users shouldn't need to search the web to find solutions to install software. We should be beyond such pettiness by this point.

This should work with an AUR helper like Yaourt simply because the average user is using that to install AUR packages.

Ralf_Mardorf commented on 2016-12-11 19:26

When became using AUR helpers a "standard" to use AUR?

Have you ever considered to read ?

murphy commented on 2016-12-11 18:55

This should work with a standard AUR update (yaourt,etc.) and it's currently breaking with a PGP integrity issue.

Understood that it's possible to add the keys, but since this is non-standard, there should be some sort of error after the package integrity fails stating both:

1) that it is expected
2) a suggestion on how to fix this (though the specific key is not necessarily needed).

andreab82 commented on 2016-11-30 15:45

DOH! Thanks lostkhaos!

lostkhaos commented on 2016-11-30 14:48

@andreab82 I believe that he just selected a server at random from the pool (perhaps one closeby to himself). You can use the command without specifying a keyserver in particular and the command will still work just fine (e.g. gpg --recv-keys [thekeyyouwant])

@Ralf_Mardorf I think your responses are pretty uncalled for. AUR comments aren't a support channel, sure, but it was a simple question with a simple answer. Your tone is one of the things that make people think Arch users are elitist jerks; telling someone to choose a different distro over a simple missing key is a bit dramatic.

Ralf_Mardorf commented on 2016-11-30 09:56

If you want to stay with Arch Linux, you need to do some research on your own.

Don't delete your comments, if you ask me to reply to your comments. Next time get your hands dirty, before you post a request.

Ralf_Mardorf commented on 2016-11-30 08:52

Please stop recommending idiotic non-solutions such as "--skippgpcheck".
The error messages informs you what to do. Inside the PKGBUILD you'll find this:


So one of several possibilities is running

gpg --keyserver hkp:// --recv-keys 58E0C111E39F5408C5D3EC76C1A60EACE707FDA5

to solve the issue. There are other ways to get the key, too.
If you need to spam the AUR comments with such a non-issue, then Arch Linux is not the appropriate Linux distribution for you. Please use another distro.

starlight commented on 2016-11-30 01:27

signature verification fails (multiple tries)

==> Verifying source file signatures with gpg...
freetype-2.7.tar.bz2 ... FAILED (error during signature verification)
freetype-doc-2.7.tar.bz2 ... FAILED (error during signature verification)
ft2demos-2.7.tar.bz2 ... FAILED (error during signature verification)
==> ERROR: One or more PGP signatures could not be verified!
==> ERROR: Makepkg was unable to build freetype2-infinality.

dobo commented on 2016-11-29 18:55

* Upgrade to 2.7.
* Sync with ABS PKGBUILD.
* Get patches from archfan.