Package Base Details: gstreamer0.10-ugly

Git Clone URL: https://aur.archlinux.org/gstreamer0.10-ugly.git (read-only, click to copy)
Submitter: yurikoles
Maintainer: None
Last Packager: gcurse
Votes: 19
Popularity: 0.172827
First Submitted: 2017-01-26 13:59
Last Updated: 2018-04-01 17:33

Latest Comments

« First ‹ Previous 1 2

mozo commented on 2017-01-29 10:39

Everything is ok now :)

Trollwut commented on 2017-01-29 04:42

Now it builds fine for me. :-)

alfredo.ardito commented on 2017-01-27 21:07

Same error...

juliohm commented on 2017-01-27 18:46

make[3]: Entering directory '/tmp/yaourt-tmp-juliohm/aur-gstreamer0.10-ugly/src/gst-plugins-ugly/gst/asfdemux'
CC libgstasf_la-gstasfdemux.lo
CC libgstasf_la-gstasf.lo
In file included from /usr/include/gstreamer-0.10/gst/gst.h:32:0,
from gstasf.c:24:
/usr/include/gstreamer-0.10/gst/gstversion.h:48:27: error: expected declaration specifiers or ‘...’ before ‘(’ token
#define GST_VERSION_MAJOR (0)
^
gstasf.c:68:21: note: in expansion of macro ‘GST_VERSION_MAJOR’
GST_PLUGIN_DEFINE2 (GST_VERSION_MAJOR,
^~~~~~~~~~~~~~~~~
/usr/include/gstreamer-0.10/gst/gstversion.h:54:27: error: expected declaration specifiers or ‘...’ before ‘(’ token
#define GST_VERSION_MINOR (10)
^
gstasf.c:69:5: note: in expansion of macro ‘GST_VERSION_MINOR’
GST_VERSION_MINOR,
^~~~~~~~~~~~~~~~~
gstasf.c:70:5: error: unknown type name ‘asf’
asf,
^~~
gstasf.c:71:5: error: expected declaration specifiers or ‘...’ before string constant
"Demuxes and muxes audio and video in Microsofts ASF format",
^~~~~~~~~~~~~~~~~~~~~~~~~~~~~~~~~~~~~~~~~~~~~~~~~~~~~~~~~~~~
gstasf.c:72:5: error: expected declaration specifiers or ‘...’ before ‘plugin_init’
plugin_init, VERSION, GST_LICENSE, GST_PACKAGE_NAME, GST_PACKAGE_ORIGIN)
^~~~~~~~~~~
In file included from gstasf.c:21:0:
../../config.h:264:17: error: expected declaration specifiers or ‘...’ before string constant
#define VERSION "0.10.19"
^
gstasf.c:72:18: note: in expansion of macro ‘VERSION’
plugin_init, VERSION, GST_LICENSE, GST_PACKAGE_NAME, GST_PACKAGE_ORIGIN)
^~~~~~~
../../config.h:42:21: error: expected declaration specifiers or ‘...’ before string constant
#define GST_LICENSE "LGPL"
^
gstasf.c:72:27: note: in expansion of macro ‘GST_LICENSE’
plugin_init, VERSION, GST_LICENSE, GST_PACKAGE_NAME, GST_PACKAGE_ORIGIN)
^~~~~~~~~~~
../../config.h:45:26: error: expected declaration specifiers or ‘...’ before string constant
#define GST_PACKAGE_NAME "GStreamer Ugly Plugins (Archlinux)"
^
../../config.h:45:26: note: in definition of macro ‘GST_PACKAGE_NAME’
#define GST_PACKAGE_NAME "GStreamer Ugly Plugins (Archlinux)"
^~~~~~~~~~~~~~~~~~~~~~~~~~~~~~~~~~~~
../../config.h:48:28: error: expected declaration specifiers or ‘...’ before string constant
#define GST_PACKAGE_ORIGIN "http://www.archlinux.org/"
^
gstasf.c:72:58: note: in expansion of macro ‘GST_PACKAGE_ORIGIN’
plugin_init, VERSION, GST_LICENSE, GST_PACKAGE_NAME, GST_PACKAGE_ORIGIN)
^~~~~~~~~~~~~~~~~~
gstasf.c:35:1: warning: ‘plugin_init’ defined but not used [-Wunused-function]
plugin_init (GstPlugin * plugin)
^~~~~~~~~~~
make[3]: *** [Makefile:612: libgstasf_la-gstasf.lo] Error 1
make[3]: Leaving directory '/tmp/yaourt-tmp-juliohm/aur-gstreamer0.10-ugly/src/gst-plugins-ugly/gst/asfdemux'
make[2]: *** [Makefile:781: asfdemux] Error 2
make[2]: Leaving directory '/tmp/yaourt-tmp-juliohm/aur-gstreamer0.10-ugly/src/gst-plugins-ugly/gst'
make[1]: *** [Makefile:600: all-recursive] Error 1
make[1]: Leaving directory '/tmp/yaourt-tmp-juliohm/aur-gstreamer0.10-ugly/src/gst-plugins-ugly'
make: *** [Makefile:529: all] Error 2
==> ERROR: A failure occurred in build().
Aborting...
==> ERROR: Makepkg was unable to build gstreamer0.10-ugly.

cml commented on 2017-01-27 13:24

Same problem.

lubo08 commented on 2017-01-27 10:48

Same problem.

cbowman57 commented on 2017-01-27 10:14

Failure to build, identical problem as Trollwut

mozo commented on 2017-01-27 10:12

I also can't update:

make[3]: *** [Makefile:612: libgstasf_la-gstasf.lo] Error 1
make[3]: Leaving directory '/tmp/makepkg/gstreamer0.10-ugly/src/gst-plugins-ugly/gst/asfdemux'
make[2]: *** [Makefile:781: asfdemux] Error 2
make[2]: Leaving directory '/tmp/makepkg/gstreamer0.10-ugly/src/gst-plugins-ugly/gst'
make[1]: *** [Makefile:600: all-recursive] Error 1
make[1]: Leaving directory '/tmp/makepkg/gstreamer0.10-ugly/src/gst-plugins-ugly'
make: *** [Makefile:529: all] Error 2
==> ERROR: A failure occurred in build().
Aborting...
==> ERROR: Makepkg was unable to build gstreamer0.10-ugly.
==> Restart building gstreamer0.10-ugly-plugins ? [y/N]

And this error:

gstasf.c:69:5: note: in expansion of macro ‘GST_VERSION_MINOR’
GST_VERSION_MINOR,
^~~~~~~~~~~~~~~~~
gstasf.c:70:5: error: unknown type name ‘asf’
asf,
^~~
gstasf.c:71:5: error: expected declaration specifiers or ‘...’ before string constant
"Demuxes and muxes audio and video in Microsofts ASF format",
^~~~~~~~~~~~~~~~~~~~~~~~~~~~~~~~~~~~~~~~~~~~~~~~~~~~~~~~~~~~
gstasf.c:72:5: error: expected declaration specifiers or ‘...’ before ‘plugin_init’
plugin_init, VERSION, GST_LICENSE, GST_PACKAGE_NAME, GST_PACKAGE_ORIGIN)
^~~~~~~~~~~
In file included from gstasf.c:21:0:
../../config.h:264:17: error: expected declaration specifiers or ‘...’ before string constant
#define VERSION "0.10.19"
^
gstasf.c:72:18: note: in expansion of macro ‘VERSION’
plugin_init, VERSION, GST_LICENSE, GST_PACKAGE_NAME, GST_PACKAGE_ORIGIN)
^~~~~~~
../../config.h:42:21: error: expected declaration specifiers or ‘...’ before string constant
#define GST_LICENSE "LGPL"
^
gstasf.c:72:27: note: in expansion of macro ‘GST_LICENSE’
plugin_init, VERSION, GST_LICENSE, GST_PACKAGE_NAME, GST_PACKAGE_ORIGIN)
^~~~~~~~~~~
../../config.h:45:26: error: expected declaration specifiers or ‘...’ before string constant
#define GST_PACKAGE_NAME "GStreamer Ugly Plugins (Archlinux)"
^
../../config.h:45:26: note: in definition of macro ‘GST_PACKAGE_NAME’
#define GST_PACKAGE_NAME "GStreamer Ugly Plugins (Archlinux)"
^~~~~~~~~~~~~~~~~~~~~~~~~~~~~~~~~~~~
../../config.h:48:28: error: expected declaration specifiers or ‘...’ before string constant
#define GST_PACKAGE_ORIGIN "http://www.archlinux.org/"
^
gstasf.c:72:58: note: in expansion of macro ‘GST_PACKAGE_ORIGIN’
plugin_init, VERSION, GST_LICENSE, GST_PACKAGE_NAME, GST_PACKAGE_ORIGIN)
^~~~~~~~~~~~~~~~~~
gstasf.c:35:1: warning: ‘plugin_init’ defined but not used [-Wunused-function]
plugin_init (GstPlugin * plugin)
^~~~~~~~~~~
make[3]: *** [Makefile:612: libgstasf_la-gstasf.lo] Error 1
make[3]: Leaving directory '/tmp/makepkg/gstreamer0.10-ugly/src/gst-plugins-ugly/gst/asfdemux'
make[2]: *** [Makefile:781: asfdemux] Error 2
make[2]: Leaving directory '/tmp/makepkg/gstreamer0.10-ugly/src/gst-plugins-ugly/gst'
make[1]: *** [Makefile:600: all-recursive] Error 1
make[1]: Leaving directory '/tmp/makepkg/gstreamer0.10-ugly/src/gst-plugins-ugly'
make: *** [Makefile:529: all] Error 2
==> ERROR: A failure occurred in build().
Aborting...
==> ERROR: Makepkg was unable to build gstreamer0.10-ugly.
==> Restart building gstreamer0.10-ugly ? [y/N]
==> -------------------------------------------
==>
==> ERROR: unable to update

Trollwut commented on 2017-01-26 21:58

In the newest version (0.10.19-16) I can't build it anymore.

Any way to solve it?

Error:

gstasf.c:35:1: warning: ‘plugin_init’ defined but not used [-Wunused-function]
plugin_init (GstPlugin * plugin)
^~~~~~~~~~~
make[3]: *** [Makefile:612: libgstasf_la-gstasf.lo] Error 1
make[3]: Leaving directory '/tmp/yaourt-tmp-cedric/aur-gstreamer0.10-ugly-plugins/src/gst-plugins-ugly/gst/asfdemux'
make[2]: *** [Makefile:781: asfdemux] Error 2
make[2]: Leaving directory '/tmp/yaourt-tmp-cedric/aur-gstreamer0.10-ugly-plugins/src/gst-plugins-ugly/gst'
make[1]: *** [Makefile:600: all-recursive] Error 1
make[1]: Leaving directory '/tmp/yaourt-tmp-cedric/aur-gstreamer0.10-ugly-plugins/src/gst-plugins-ugly'
make: *** [Makefile:529: all] Error 2
==> ERROR: A failure occurred in build().
Aborting...
==> ERROR: Makepkg was unable to build gstreamer0.10-ugly.
==> Restart building gstreamer0.10-ugly-plugins ? [y/N]
==> ---------------------------------------------------
==>
==> ERROR: unable to update