Flagged Out-of-Date Comment: linthesia

Mahadeva flagged linthesia out-of-date on 2022-01-02 (UTC) for the following reason:

Quite clearly, this package does not want to install from aur by using yay. Error is this:: -- make[2]: *** [Makefile:419: callback.lo] Error 1 make[2]: Leaving directory '/home/user/.cache/yay/gconfmm/src/gconfmm-2.28.3/gconf/gconfmm' make[1]: *** [Makefile:465: all-recursive] Error 1 make[1]: Leaving directory '/home/user/.cache/yay/gconfmm/src/gconfmm-2.28.3' make: *** [Makefile:318: all] Error 2 ==> ERROR: A failure occurred in build(). Aborting... -> error making: gconfmm