Package Base Details: llvm35

Git Clone URL: https://aur.archlinux.org/llvm35.git (read-only, click to copy)
Submitter: pure-aur
Maintainer: pure-aur
Last Packager: pure-aur
Votes: 1
Popularity: 0.000001
First Submitted: 2018-04-08 08:02 (UTC)
Last Updated: 2021-10-13 11:24 (UTC)

Latest Comments

1 2 Next › Last »

aggraef commented on 2021-10-15 09:45 (UTC)

Strange. pod2html is in the perl package, are you sure that you have that inbstalled? Maybe an unusual PATH setting? That's all I can think of right now.

trardokont commented on 2021-10-15 04:39 (UTC)

After re-installing the base-devel group I still get the same error.

micwoj92 commented on 2021-10-14 19:34 (UTC)

You need to install base-devel group.

trardokont commented on 2021-10-14 18:18 (UTC)

When upgrading via yay llvm35-libs 3.5.2-7 -> 3.5.2-8 I get the following error, not even a clean build works:


make[2]: Entering directory '/home/$USER/.cache/yay/llvm35/src/llvm-3.5.2.src/tools/clang/docs/tools'
pod2html --css=manpage.css --htmlroot=. \
  --podpath=. --infile=clang.pod --outfile=/home/$USER/.cache/yay/llvm35/src/llvm-3.5.2.src/tools/clang/docs/tools/clang.html --title=clang
make[2]: pod2html: No such file or directory
make[2]: *** [Makefile:69: /home/$USER/.cache/yay/llvm35/src/llvm-3.5.2.src/tools/clang/docs/tools/clang.html] Error 127
rm /home/$USER/.cache/yay/llvm35/src/llvm-3.5.2.src/tools/clang/docs/tools//.dir
make[2]: Leaving directory '/home/$USER/.cache/yay/llvm35/src/llvm-3.5.2.src/tools/clang/docs/tools'
make[1]: *** [/home/$USER/.cache/yay/llvm35/src/llvm-3.5.2.src/Makefile.rules:888: install] Error 1
make[1]: Leaving directory '/home/$USER/.cache/yay/llvm35/src/llvm-3.5.2.src/tools/clang/docs'
make: *** [/home/$USER/.cache/yay/llvm35/src/llvm-3.5.2.src/Makefile.rules:888: install] Error 1
==> ERROR: A failure occurred in package_clang35().
    Aborting...
 -> error making: llvm35 (llvm35-libs)

micwoj92 commented on 2021-10-13 13:13 (UTC)

Maybe there is some bug with OBS not downloading packages from base-devel?

aggraef commented on 2021-10-13 13:02 (UTC)

That's true, but I'm using the same PKGBUILD for the OBS (Open Build Service), where for some reason the groff dependency is needed.

micwoj92 commented on 2021-10-13 12:36 (UTC)

groff is part of base-devel, no need to add it to makedepends

aggraef commented on 2021-10-13 07:43 (UTC)

Fixed. micwoj92 and everybody else, thanks for your patience.

micwoj92 commented on 2021-10-13 07:40 (UTC)

Thanks for fixing

aggraef commented on 2021-10-09 06:54 (UTC)

micwoj92, can you give me another week, please? I really didn't have the time to work on it while I was on vacation, but I'll get on it next week.