Package Base Details: pyside2-git

Git Clone URL: https://aur.archlinux.org/pyside2-git.git (read-only)
Submitter: drhooves
Maintainer: Cebtenzzre
Last Packager: Cebtenzzre
Votes: 2
Popularity: 0.000082
First Submitted: 2017-03-03 08:15
Last Updated: 2019-03-01 21:27

Latest Comments

« First ‹ Previous 1 2 3 4 Next › Last »

xantares commented on 2017-11-02 12:34

yes, shiboken2 is not up to date, I asked it to be orphaned

mriyah commented on 2017-11-02 12:33

same for me.

zoidberg commented on 2017-11-02 01:45

Build fails as follows (I am posting this as I couldn't find the same error in any of the previous posts).

==> Making package: pyside2-git 2.0.0.r5308.25f899e2-1 (Thu Nov 2 07:03:25 IST 2017)
==> Checking runtime dependencies...
==> Checking buildtime dependencies...
==> Retrieving sources...
-> Updating pyside2-git git repo...
Fetching origin
-> Found fix-module-name.patch
-> Found sphinx-build2.patch
==> Validating source files with md5sums...
pyside2-git ... Skipped
fix-module-name.patch ... Passed
sphinx-build2.patch ... Passed
==> Extracting sources...
-> Creating working copy of pyside-setup git repo...
Cloning into 'pyside2-git'...
done.
Switched to a new branch 'makepkg'
==> Starting prepare()...
==> Starting pkgver()...
==> Starting build()...
-- The C compiler identification is GNU 7.2.0
-- The CXX compiler identification is GNU 7.2.0
-- Check for working C compiler: /usr/bin/cc
-- Check for working C compiler: /usr/bin/cc -- works
-- Detecting C compiler ABI info
-- Detecting C compiler ABI info - done
-- Detecting C compile features
-- Detecting C compile features - done
-- Check for working CXX compiler: /usr/bin/c++
-- Check for working CXX compiler: /usr/bin/c++ -- works
-- Detecting CXX compiler ABI info
-- Detecting CXX compiler ABI info - done
-- Detecting CXX compile features
-- Detecting CXX compile features - done
-- Found PythonInterp: /usr/bin/python2 (found suitable version "2.7.14", minimum required is "2")
-- Found PythonLibs: /usr/lib/libpython2.7.so (found suitable version "2.7.14", minimum required is "2")
-- PYTHON_EXTENSION_SUFFIX: -python2.7
-- PYTHON_CONFIG_SUFFIX: -python2.7-python2.7
-- PYTHON_SHARED_LIBRARY_SUFFIX: -python2.7-python2.7
-- libshiboken built for Release
result:/usr/include/GL/gl.h
-- *** Qt5Core_INCLUDE_DIRS = /usr/include/qt/;/usr/include/qt/QtCore;/usr/lib/qt//mkspecs/linux-g++
-- *** computed QT_INCLUDE_DIR as /usr/include/qt/
-- Found Git: /usr/bin/git (found version "2.15.0")
-- module Qt5Core found ()
-- module Qt5Gui found (essential)
-- module Qt5Widgets found (essential)
-- module Qt5PrintSupport found (essential)
-- module Qt5Sql found (essential)
-- module Qt5Network found (essential)
-- module Qt5Test found (essential)
-- module Qt5Concurrent found (essential)
-- module Qt5X11Extras found (essential)
-- module Qt5Xml found ()
-- module Qt5XmlPatterns found (opt)
-- module Qt5Help found (opt)
-- module Qt5Multimedia found (opt)
-- module Qt5MultimediaWidgets found (opt)
-- module Qt5OpenGL found (opt)
-- module Qt5Qml found (opt)
-- module Qt5Quick found (opt)
-- module Qt5QuickWidgets found (opt)
-- module Qt5Script found (opt)
-- module Qt5ScriptTools found (opt)
-- module Qt5TextToSpeech found (opt)
CMake Warning at CMakeLists.txt:228 (find_package):
By not providing "FindQt5Charts.cmake" in CMAKE_MODULE_PATH this project
has asked CMake to find a package configuration file provided by
"Qt5Charts", but CMake did not find one.

Could not find a package configuration file provided by "Qt5Charts" with
any of the following names:

Qt5ChartsConfig.cmake
qt5charts-config.cmake

Add the installation prefix of "Qt5Charts" to CMAKE_PREFIX_PATH or set
"Qt5Charts_DIR" to a directory containing one of the above files. If
"Qt5Charts" provides a separate development package or SDK, be sure it has
been installed.
Call Stack (most recent call first):
CMakeLists.txt:291 (COLLECT_MODULE_IF_FOUND)


-- optional module Qt5Charts skipped
-- module Qt5Svg found (opt)
CMake Warning at CMakeLists.txt:228 (find_package):
By not providing "FindQt5DataVisualization.cmake" in CMAKE_MODULE_PATH this
project has asked CMake to find a package configuration file provided by
"Qt5DataVisualization", but CMake did not find one.

Could not find a package configuration file provided by
"Qt5DataVisualization" with any of the following names:

Qt5DataVisualizationConfig.cmake
qt5datavisualization-config.cmake

Add the installation prefix of "Qt5DataVisualization" to CMAKE_PREFIX_PATH
or set "Qt5DataVisualization_DIR" to a directory containing one of the
above files. If "Qt5DataVisualization" provides a separate development
package or SDK, be sure it has been installed.
Call Stack (most recent call first):
CMakeLists.txt:293 (COLLECT_MODULE_IF_FOUND)


-- optional module Qt5DataVisualization skipped
-- module Qt5UiTools found (opt)
-- module Qt5WebChannel found (opt)
-- module Qt5WebEngineWidgets found (opt)
-- module Qt5WebKit found (opt)
-- module Qt5WebKitWidgets found (opt)
-- module Qt5WebSockets found (opt)
-- Detected OS: x11
-- PySide will be generated using the protected hack!
-- Checking for QGtkStyle in QtWidgets -- not found
-- Checking for QMacStyle in QtWidgets -- not found
-- Checking for QSslCertificate in QtNetwork -- not found
-- Checking for QSslCipher in QtNetwork -- not found
-- Checking for QSslConfiguration in QtNetwork -- not found
-- Checking for QSslError in QtNetwork -- not found
-- Checking for QSslKey in QtNetwork -- not found
-- Checking for QSslSocket in QtNetwork -- not found
-- QT_SRC_DIR variable not set, apidoc generation targets disabled.
-- Configuring done
-- Generating done
-- Build files have been written to: /home/kishore/.cache/pacaur/pyside2-git/src/pyside2-git/sources/pyside2/build-py2
[ 0%] Generating moc_customwidgets.cpp
[ 0%] Generating moc_destroylistener.cpp
[ 0%] Generating moc_customwidget.cpp
Scanning dependencies of target pyside2
[ 0%] Building CXX object libpyside/CMakeFiles/pyside2.dir/dynamicqmetaobject.cpp.o
[ 0%] Building CXX object libpyside/CMakeFiles/pyside2.dir/destroylistener.cpp.o
[ 1%] Building CXX object libpyside/CMakeFiles/pyside2.dir/signalmanager.cpp.o
Scanning dependencies of target uiplugin
[ 1%] Building CXX object libpyside/CMakeFiles/pyside2.dir/globalreceiver.cpp.o
[ 1%] Building CXX object plugins/CMakeFiles/uiplugin.dir/customwidgets.cpp.o
[ 1%] Building CXX object libpyside/CMakeFiles/pyside2.dir/globalreceiverv2.cpp.o
[ 1%] Building CXX object plugins/CMakeFiles/uiplugin.dir/customwidget.cpp.o
[ 1%] Building CXX object libpyside/CMakeFiles/pyside2.dir/pysideclassinfo.cpp.o
/home/kishore/.cache/pacaur/pyside2-git/src/pyside2-git/sources/pyside2/build-py2/libpyside/signalmanager.cpp: In member function ‘void PySide::SignalManager::addGlobalSlot(const char*, PyObject*)’:
/home/kishore/.cache/pacaur/pyside2-git/src/pyside2-git/sources/pyside2/build-py2/libpyside/signalmanager.cpp:348:41: warning: ‘int PySide::SignalManager::addGlobalSlotGetIndex(const char*, PyObject*)’ is deprecated [-Wdeprecated-declarations]
addGlobalSlotGetIndex(slot, callback);
^
In file included from /home/kishore/.cache/pacaur/pyside2-git/src/pyside2-git/sources/pyside2/libpyside/signalmanager.h:43:0,
from /home/kishore/.cache/pacaur/pyside2-git/src/pyside2-git/sources/pyside2/build-py2/libpyside/signalmanager.cpp:41:
/home/kishore/.cache/pacaur/pyside2-git/src/pyside2-git/sources/pyside2/libpyside/signalmanager.h:101:27: note: declared here
PYSIDE_DEPRECATED(int addGlobalSlotGetIndex(const char* slot, PyObject* callback));
^
/home/kishore/.cache/pacaur/pyside2-git/src/pyside2-git/sources/pyside2/libpyside/pysidemacros.h:57:41: note: in definition of macro ‘PYSIDE_DEPRECATED’
#define PYSIDE_DEPRECATED(func) func __attribute__ ((deprecated))
^~~~
[ 1%] Building CXX object plugins/CMakeFiles/uiplugin.dir/moc_customwidget.cpp.o
[ 1%] Building CXX object libpyside/CMakeFiles/pyside2.dir/pysidemetafunction.cpp.o
[ 1%] Building CXX object libpyside/CMakeFiles/pyside2.dir/pysidesignal.cpp.o
[ 1%] Building CXX object plugins/CMakeFiles/uiplugin.dir/moc_customwidgets.cpp.o
[ 1%] Building CXX object libpyside/CMakeFiles/pyside2.dir/pysideslot.cpp.o
[ 1%] Building CXX object libpyside/CMakeFiles/pyside2.dir/pysideproperty.cpp.o
[ 1%] Building CXX object libpyside/CMakeFiles/pyside2.dir/pysideqflags.cpp.o
[ 1%] Building CXX object libpyside/CMakeFiles/pyside2.dir/pysideweakref.cpp.o
[ 2%] Building CXX object libpyside/CMakeFiles/pyside2.dir/pyside.cpp.o
/home/kishore/.cache/pacaur/pyside2-git/src/pyside2-git/sources/pyside2/libpyside/pyside.cpp:53:10: fatal error: qapp_macro.h: No such file or directory
#include <qapp_macro.h>
^~~~~~~~~~~~~~
compilation terminated.
make[2]: *** [libpyside/CMakeFiles/pyside2.dir/build.make:355: libpyside/CMakeFiles/pyside2.dir/pyside.cpp.o] Error 1
make[2]: *** Waiting for unfinished jobs....
[ 3%] Linking CXX static library libuiplugin.a
[ 3%] Built target uiplugin
make[1]: *** [CMakeFiles/Makefile2:150: libpyside/CMakeFiles/pyside2.dir/all] Error 2
make: *** [Makefile:130: all] Error 2
==> ERROR: A failure occurred in build().
Aborting...

mriyah commented on 2017-10-31 17:36

Build failure.
Got this:
==> Starting prepare()...
can't find file to patch at input line 5
Perhaps you used the wrong -p or --strip option?
The text leading up to this was:
--------------------------
|diff --git a/doc/CMakeLists.txt b/doc/CMakeLists.txt
|index c5d0169d..a4f246b3 100644
|--- a/doc/CMakeLists.txt
|+++ b/doc/CMakeLists.txt
--------------------------
File to patch:

xantares commented on 2017-08-25 20:41

They moved to:
https://code.qt.io/pyside/pyside-setup.git, (/sources/pyside2)
see http://code.qt.io/cgit/
please update

angri commented on 2017-07-28 13:54

Fails to build for me with the same error.

webhive commented on 2017-06-27 18:19

I've got same issue

Keeping temporary file: /tmp/pyside2_global_J18850.hpp
shiboken: Error running ApiExtractor.
Command line: --generator-set=shiboken --enable-parent-ctor-heuristic --enable-pyside-extensions --enable-return-value-heuristic --use-isnull-as-nb_nonzero /tmp/yaourt-tmp-roman/aur-python2-pyside2-git/src/pyside2-git/build-py2/PySide2/pyside2_global.h --include-paths=/tmp/yaourt-tmp-roman/aur-python2-pyside2-git/src/pyside2-git/PySide2:/usr/include/qt/ --typesystem-paths=/tmp/yaourt-tmp-roman/aur-python2-pyside2-git/src/pyside2-git/PySide2:/tmp/yaourt-tmp-roman/aur-python2-pyside2-git/src/pyside2-git/PySide2/QtCore --output-directory=/tmp/yaourt-tmp-roman/aur-python2-pyside2-git/src/pyside2-git/build-py2/PySide2/QtCore --license-file=/tmp/yaourt-tmp-roman/aur-python2-pyside2-git/src/pyside2-git/PySide2/QtCore/../licensecomment.txt /tmp/yaourt-tmp-roman/aur-python2-pyside2-git/src/pyside2-git/build-py2/PySide2/QtCore/typesystem_core.xml --api-version=5.9 --drop-type-entries=
make[2]: *** [PySide2/QtCore/CMakeFiles/QtCore.dir/build.make:66: PySide2/QtCore/PySide2/QtCore/qabstractanimation_wrapper.cpp] Ошибка 1

lyra commented on 2017-06-20 19:13

I've got an error. Here is log: https://pastebin.com/B0mhUwMQ

Keeping temporary file: /tmp/pyside2_global_J27614.hpp
shiboken: Error running ApiExtractor.
Command line: --generator-set=shiboken --enable-parent-ctor-heuristic --enable-pyside-extensions --enable-return-value-heuristic --use-isnull-as-nb_nonzero /tmp/yaourt-tmp-lyra/aur-python2-pyside2-git/src/pyside2-git/build-py2/PySide2/pyside2_global.h --include-paths=/tmp/yaourt-tmp-lyra/aur-python2-pyside2-git/src/pyside2-git/PySide2:/usr/include/qt/ --typesystem-paths=/tmp/yaourt-tmp-lyra/aur-python2-pyside2-git/src/pyside2-git/PySide2:/tmp/yaourt-tmp-lyra/aur-python2-pyside2-git/src/pyside2-git/PySide2/QtCore --output-directory=/tmp/yaourt-tmp-lyra/aur-python2-pyside2-git/src/pyside2-git/build-py2/PySide2/QtCore --license-file=/tmp/yaourt-tmp-lyra/aur-python2-pyside2-git/src/pyside2-git/PySide2/QtCore/../licensecomment.txt /tmp/yaourt-tmp-lyra/aur-python2-pyside2-git/src/pyside2-git/build-py2/PySide2/QtCore/typesystem_core.xml --api-version=5.8 --drop-type-entries=
make[2]: *** [PySide2/QtCore/CMakeFiles/QtCore.dir/build.make:66: PySide2/QtCore/PySide2/QtCore/qabstractanimation_wrapper.cpp] Error 1
make[1]: *** [CMakeFiles/Makefile2:355: PySide2/QtCore/CMakeFiles/QtCore.dir/all] Error 2
make: *** [Makefile:130: all] Error 2

drhooves commented on 2017-06-18 12:54

Could you post the error message from earlier in the log too please?

s218 commented on 2017-06-18 12:15

make[2]: *** [PySide2/QtCore/CMakeFiles/QtCore.dir/build.make:66: PySide2/QtCore/PySide2/QtCore/qabstractanimation_wrapper.cpp] Ошибка 1
make[1]: *** [CMakeFiles/Makefile2:355: PySide2/QtCore/CMakeFiles/QtCore.dir/all] Ошибка 2
make: *** [Makefile:130: all] Ошибка 2
==> ОШИБКА: Произошел сбой в build().
Прерывание...
==> ОШИБКА: Makepkg не смог собрать .
==> Перезапустить сборку python2-pyside2-git ? да/Нет [y/N]