Package Base Details: shiboken

Git Clone URL: https://aur.archlinux.org/shiboken.git (read-only, click to copy)
Submitter: arojas
Maintainer: adsun
Last Packager: adsun
Votes: 8
Popularity: 0.003314
First Submitted: 2018-08-21 10:44
Last Updated: 2019-11-22 16:27

Pinned Comments

adsun commented on 2020-03-06 19:22

@kunda Rebuild qt4 from the AUR whenever icu is updated in the main repo. Then build shiboken.

qt4 used to be in the main repo but was moved back to the AUR due to being deprecated over qt5.

Latest Comments

« First ‹ Previous 1 2 3

Tio commented on 2019-11-17 14:45

@adsun here it is the same:

Detecting inconsistencies in typesystem...   [OK]
make[2]: *** [shibokenmodule/CMakeFiles/shibokenmodule.dir/build.make:62: shibokenmodule/shiboken/shiboken_module_wrapper.cpp] Segmentation fault (core dumped)
make[1]: *** [CMakeFiles/Makefile2:350: shibokenmodule/CMakeFiles/shibokenmodule.dir/all] Error 2
make: *** [Makefile:130: all] Error 2
==> ERROR: A failure occurred in build().
    Aborting...

adsun commented on 2019-11-17 14:39

@Kunda I just updated the package to use the correct include directory and library name for python versions less than 3.8.0. Does this work now?

adsun commented on 2019-11-17 14:20

@Kunda I noticed that the current python version is 3.7.4 on Manjaro. Recently Arch updated python to version 3.8.0.

Kunda commented on 2019-11-17 12:13

I can reproduce @Tio's error
Description: Manjaro Linux
Release: 18.1.3
Codename: Juhraya
Python 3.7.4
cmake version 3.15.5

[ 96%] Running generator for 'shiboken'...
Detecting inconsistencies in typesystem...   [OK]
make[2]: *** [shibokenmodule/CMakeFiles/shibokenmodule.dir/build.make:62: shibokenmodule/shiboken/shiboken_module_wrapper.cpp] Segmentation fault (core dumped)
make[1]: *** [CMakeFiles/Makefile2:350: shibokenmodule/CMakeFiles/shibokenmodule.dir/all] Error 2
make: *** [Makefile:130: all] Error 2
==> ERROR: A failure occurred in build().
    Aborting...

adsun commented on 2019-11-16 20:46

@Tio I cannot reproduce your error. This builds fine in a clean chroot.

Tio commented on 2019-11-16 19:01

Error on Manjaro Gnome Stable:

Detecting inconsistencies in typesystem...   [OK]
make[2]: *** [shibokenmodule/CMakeFiles/shibokenmodule.dir/build.make:62: shibokenmodule/shiboken/shiboken_module_wrapper.cpp] Segmentation fault (core dumped)
make[1]: *** [CMakeFiles/Makefile2:350: shibokenmodule/CMakeFiles/shibokenmodule.dir/all] Error 2
make: *** [Makefile:130: all] Error 2
==> ERROR: A failure occurred in build().
    Aborting...

vonWolfens commented on 2019-07-24 13:15

When building qt4 from the AUR one needs to add the argument -xmlpatterns to the ./configure script in PKGBUILD for this package to build correctly. It seems that it has been removed from the default options

Zeioth commented on 2019-06-19 11:53

It fails to build on my end. Seems to be an issue with the new version of QT: https://pastebin.com/raw/Gr7kuyw3