Package Base Details: shiboken2-git

Git Clone URL: https://aur.archlinux.org/shiboken2-git.git (read-only)
Submitter: drhooves
Maintainer: Cebtenzzre
Last Packager: Cebtenzzre
Votes: 2
Popularity: 0.001067
First Submitted: 2017-03-03 08:11
Last Updated: 2019-03-01 22:09

Latest Comments

« First ‹ Previous 1 2

Grawp commented on 2018-03-06 20:16

_upver and pkgver prefix should be now "5.9.0". There have been some versioning changes recently http://code.qt.io/cgit/pyside/pyside-setup.git/commit/sources/shiboken2/shiboken_version.py?h=5.9&id=f3139399b273fdf405f20cba32a08262cd933d6e

http://code.qt.io/cgit/pyside/pyside-setup.git/log/sources/shiboken2/shiboken_version.py?h=5.9&id=63bcb1ba4a1b211f219b1b47aa4b3ad85a8b7a77

(Also without changing the version installation script fails on trying to remove .cmake filed from non-existent directories.)

Cheers

Grawp commented on 2018-02-25 10:15

llvm makedependency is missing. Could you add it please?

xantares commented on 2017-08-25 20:41

Shiboken2 was moved to:
https://code.qt.io/pyside/pyside-setup.git, (/sources/shiboken2)
see http://code.qt.io/cgit/
please update

croick commented on 2017-08-22 16:13

using clang as compiler solved the issue for me:
CC=clang CXX=clang++ cmake ...

drhooves commented on 2017-06-20 05:57

Mhhh very strange... honesty have no idea on how to resolve that. Please let me know if someone else also experiences that error.

reklrekl commented on 2017-06-18 19:28

obviously I installed base-devel group and I've compiled a ton of other programs successfuly...
features.h exists in /usr/include/, I don't know why it's only looking for int in /usr/include/c++/7.1.1/

drhooves commented on 2017-06-18 15:54

Does the file /usr/include/features.h exist on your system? It comes with glibc and should be installed as part of base.

reklrekl commented on 2017-06-18 15:01

I can't compile PySide2 because of an error in Shiboken2 (ApiExtractor)

I've turned on tests in build of Shiboken2 and they fail with the same error:

[ 64%] Running generator for 'minimal' test binding...
clang_parseTranslationUnit2(0x0, cmd[7]=-nostdinc -std=c++14 -fPIC -fno-exceptions -Wno-constant-logical-operand -I/home/leo/builds/shiboken2-git/src/shiboken2-git/tests/libminimal /tmp/global_J19728.hpp)
/../lib64/gcc/x86_64-pc-linux-gnu/7.1.1/../../../../include/c++/7.1.1/x86_64-pc-linux-gnu/bits/os_defines.h:39:10: fatal error: 'features.h' file not found
Errors in /tmp/global_J19728.hpp:
/../lib64/gcc/x86_64-pc-linux-gnu/7.1.1/../../../../include/c++/7.1.1/x86_64-pc-linux-gnu/bits/os_defines.h:39:10: fatal: 'features.h' file not found
/tmp/global_J19728.hpp:32:10: note: in file included from /tmp/global_J19728.hpp:32:
/home/leo/builds/shiboken2-git/src/shiboken2-git/tests/libminimal/listuser.h:32:10: note: in file included from /home/leo/builds/shiboken2-git/src/shiboken2-git/tests/libminimal/listuser.h:32:
/../lib64/gcc/x86_64-pc-linux-gnu/7.1.1/../../../../include/c++/7.1.1/list:60:10: note: in file included from /../lib64/gcc/x86_64-pc-linux-gnu/7.1.1/../../../../include/c++/7.1.1/list:60:
/../lib64/gcc/x86_64-pc-linux-gnu/7.1.1/../../../../include/c++/7.1.1/bits/stl_algobase.h:59:10: note: in file included from /../lib64/gcc/x86_64-pc-linux-gnu/7.1.1/../../../../include/c++/7.1.1/bits/stl_algobase.h:59:
/../lib64/gcc/x86_64-pc-linux-gnu/7.1.1/../../../../include/c++/7.1.1/x86_64-pc-linux-gnu/bits/c++config.h:533:10: note: in file included from /../lib64/gcc/x86_64-pc-linux-gnu/7.1.1/../../../../include/c++/7.1.1/x86_64-pc-linux-gnu/bits/c++config.h:533:


Clang: 1 diagnostic messages:
/../lib64/gcc/x86_64-pc-linux-gnu/7.1.1/../../../../include/c++/7.1.1/x86_64-pc-linux-gnu/bits/os_defines.h:39:10: fatal: 'features.h' file not found
/tmp/global_J19728.hpp:32:10: note: in file included from /tmp/global_J19728.hpp:32:
/home/leo/builds/shiboken2-git/src/shiboken2-git/tests/libminimal/listuser.h:32:10: note: in file included from /home/leo/builds/shiboken2-git/src/shiboken2-git/tests/libminimal/listuser.h:32:
/../lib64/gcc/x86_64-pc-linux-gnu/7.1.1/../../../../include/c++/7.1.1/list:60:10: note: in file included from /../lib64/gcc/x86_64-pc-linux-gnu/7.1.1/../../../../include/c++/7.1.1/list:60:
/../lib64/gcc/x86_64-pc-linux-gnu/7.1.1/../../../../include/c++/7.1.1/bits/stl_algobase.h:59:10: note: in file included from /../lib64/gcc/x86_64-pc-linux-gnu/7.1.1/../../../../include/c++/7.1.1/bits/stl_algobase.h:59:
/../lib64/gcc/x86_64-pc-linux-gnu/7.1.1/../../../../include/c++/7.1.1/x86_64-pc-linux-gnu/bits/c++config.h:533:10: note: in file included from /../lib64/gcc/x86_64-pc-linux-gnu/7.1.1/../../../../include/c++/7.1.1/x86_64-pc-linux-gnu/bits/c++config.h:533:


Keeping temporary file: /tmp/global_J19728.hpp
shiboken: Error running ApiExtractor.
Command line: --project-file=/home/leo/builds/shiboken2-git/src/shiboken2-git/build-py3/tests/minimalbinding/minimal-binding.txt
make[2]: *** [tests/minimalbinding/CMakeFiles/minimal.dir/build.make:64: tests/minimalbinding/minimal/minimal_module_wrapper.cpp] Fehler 1
make[1]: *** [CMakeFiles/Makefile2:3290: tests/minimalbinding/CMakeFiles/minimal.dir/all] Fehler 2
make: *** [Makefile:141: all] Fehler 2

drhooves commented on 2017-05-31 14:27

Thanks for the info, I already made the changes you proposed but the build failed somewhere else for me and I wasn't able to resolve that as far as I remember... I'm going to have a look at it again as soon as possible.

sheinz commented on 2017-05-31 09:13

If you encounter error:‘qAsConst’ was not declared in this scope
You should switch to "5.6" branch of shiboken. Edit PKGBUILD:
source=("$pkgbase::git+https://code.qt.io/pyside/shiboken.git#branch=5.6"
"sphinx-build2.patch")

If you get error "install: cannot stat 'Shiboken2Config-python2.7.cmake': No such file or directory"
Add option -DPYTHON_EXTENSION_SUFFIX="-python2.7" for cmake build for python2