Package Base Details: vala-panel-appmenu-xfce-git

Git Clone URL: (read-only, click to copy)
Submitter: rilian
Maintainer: rilian
Last Packager: rilian
Votes: 34
Popularity: 0.90
First Submitted: 2015-04-01 21:00
Last Updated: 2019-08-16 22:36

Latest Comments

« First ‹ Previous ... 5 6 7 8 9 10 11 Next › Last »

rilian commented on 2017-02-09 19:01

Will look for it.

buba commented on 2017-02-09 18:18


make[3]: *** [Makefile:691: html-build.stamp] Error 5
make[3]: Leaving directory '/tmp/yaourt-tmp-all/aur-unity-gtk-module-standalone-bzr/src/trunk.15.04/build-gtk2/docs/reference/unity-gtk-module'
make[2]: *** [Makefile:375: all-recursive] Error 1
make[2]: Leaving directory '/tmp/yaourt-tmp-all/aur-unity-gtk-module-standalone-bzr/src/trunk.15.04/build-gtk2/docs/reference'
make[1]: *** [Makefile:375: all-recursive] Error 1
make[1]: Leaving directory '/tmp/yaourt-tmp-all/aur-unity-gtk-module-standalone-bzr/src/trunk.15.04/build-gtk2/docs'
make: *** [Makefile:413: all-recursive] Error 1
==> ERROR: A failure occurred in build().

==> Retrieving sources...
-> Pulling
bzr: ERROR: Not a branch: "/home/all/.cache/pacaur/unity-gtk-module-standalone-bzr/trunk.15.04/.bzr/branch/": location is a repository.
==> WARNING: Failure while pulling
-> Found 80unity-gtk-module
-> Found unity-gtk-module-gsettings.patch
==> Validating source files with sha512sums...
trunk.15.04 ... Skipped
80unity-gtk-module ... Passed
unity-gtk-module-gsettings.patch ... Passed
==> Extracting sources...
-> Creating working copy of trunk.15.04 bzr repo...
bzr: ERROR: Not a branch: "/home/all/.cache/pacaur/unity-gtk-module-standalone-bzr/trunk.15.04/.bzr/branch/": location is a repository.
==> ERROR: Failure while creating working copy of trunk.15.04 bzr repo
:: failed to build unity-gtk-module-standalone-bzr package(s)

rilian commented on 2017-02-05 16:57

Can you set LANG=C for logs?

buba commented on 2017-02-05 10:36

I cant build this pkg with yaourt. I have few errors.

make[3]: *** [Makefile:691: html-build.stamp] Błąd 5
make[3]: Opuszczenie katalogu '/tmp/yaourt-tmp-all/aur-unity-gtk-module-standalone-bzr/src/trunk.15.04/build-gtk2/docs/reference/unity-gtk-module'
make[2]: *** [Makefile:375: all-recursive] Błąd 1
make[2]: Opuszczenie katalogu '/tmp/yaourt-tmp-all/aur-unity-gtk-module-standalone-bzr/src/trunk.15.04/build-gtk2/docs/reference'
make[1]: *** [Makefile:375: all-recursive] Błąd 1
make[1]: Opuszczenie katalogu '/tmp/yaourt-tmp-all/aur-unity-gtk-module-standalone-bzr/src/trunk.15.04/build-gtk2/docs'
make: *** [Makefile:413: all-recursive] Błąd 1
==> BŁĄD: Wystąpił błąd w build().

Using pacaur:
==> Rozpakowywanie źródeł...
-> Tworzenie kopii roboczej repozytorium trunk.15.04 bzr...
bzr: ERROR: Not a branch: "/home/all/.cache/pacaur/unity-gtk-module-standalone-bzr/trunk.15.04/.bzr/branch/": location is a repository.
==> BŁĄD: Wystąpił błąd podczas tworzenia kopii roboczej repozytorium trunk.15.04 bzr
:: nie udało się zbudować pakietów unity-gtk-module-standalone-bzr

This is the same error as josephscade.

buba commented on 2017-02-03 15:07

ok, its a bzr bug with python 2.7.13 not this pkg.

rilian commented on 2017-02-01 18:33

logs, please

buba commented on 2017-02-01 18:16

I have error with bzr and python 2.7.13 trying to build this pkg

rilian commented on 2017-01-30 06:44

Works for me (I using pacaur). What helper are you using?

josephscade commented on 2017-01-29 11:47

Compilation doesn't work for me :

==> Extracting sources...
-> Creating a copy of repository trunk.15.04 bzr...
bzr: ERROR: Unprintable exception NotBranchError: dict={'path': u'/tmp/unity-gtk-module-standalone-bzr/trunk.15.04/.bzr/branch/', '_preformatted_string': None, 'extra': '', 'detail': ': location is a repository', 'bzrdir': <BzrDirMeta1 at 'file:///tmp/unity-gtk-module-standalone-bzr/trunk.15.04/'>}, fmt='Not a branch: "%(path)s"%(detail)s.', error=TypeError('first argument must be string or compiled pattern',)
==> ERROR : Failed to create a copy of the repository trunk.15.04 bzr

Some translations may be incorrect because my computer's locale is not the english.

Anonymous comment on 2016-07-08 15:48

rm $srcdir/$_pkgname/vapi/glib-2.0.vapi