Package Base Details: vte3-notification

Git Clone URL: https://aur.archlinux.org/vte3-notification.git (read-only, click to copy)
Keywords: gnome
Submitter: BerelTarMaciltur
Maintainer: mydongistiny
Last Packager: mydongistiny
Votes: 32
Popularity: 0.28
First Submitted: 2015-03-29 22:27
Last Updated: 2020-05-03 00:54

Latest Comments

« First ‹ Previous 1 2 3 4 5 Next › Last »

dsboger commented on 2017-02-07 06:00

@Kurayami I've made some tests and it seems the last update of gperf breaks compilation of vte3-notification. I don't know if the problem is in the Fedora patches or VTE itself. Please, could you check with upstream [1] and report the issue if necessary? For now, the workaround is to downgrade gperf to 3.0.4.

Thanks for reporting!

[1] https://bugzilla.gnome.org/

Kurayami commented on 2017-02-07 05:46

vte3-notification fails to build:

vteseq.cc: In function ‘void (* _vte_sequence_get_handler(const char*))(VteTerminalPrivate*, GValueArray*)’:
vteseq.cc:3516:42: error: call of overloaded ‘vteseq_n_lookup(const char*&, int&)’ is ambiguous
seqhandler = vteseq_n_lookup (name, len);
^
vteseq.cc:3502:1: note: candidate: const vteseq_n_struct* vteseq_n_lookup(const char*, unsigned int)
vteseq_n_lookup (register const char *str, register unsigned int len);
^~~~~~~~~~~~~~~
In file included from vteseq.cc:3503:0:
vteseq-n.gperf:295:1: note: candidate: const vteseq_n_struct* vteseq_n_lookup(const char*, size_t)
vteseq.cc: At global scope:
vteseq.cc:3502:1: warning: ‘const vteseq_n_struct* vteseq_n_lookup(const char*, unsigned int)’ declared ‘static’ but never defined [-Wunused-function]
vteseq_n_lookup (register const char *str, register unsigned int len);
^~~~~~~~~~~~~~~
make[3]: *** [Makefile:1755: libvte_2_91_la-vteseq.lo] Error 1
make[3]: Leaving directory '/tmp/yaourt-tmp-kurayami/aur-vte3-notification/src/vte-0.46.1/src'
make[2]: *** [Makefile:1200: all] Error 2
make[2]: Leaving directory '/tmp/yaourt-tmp-kurayami/aur-vte3-notification/src/vte-0.46.1/src'
make[1]: *** [Makefile:570: all-recursive] Error 1
make[1]: Leaving directory '/tmp/yaourt-tmp-kurayami/aur-vte3-notification/src/vte-0.46.1'
make: *** [Makefile:477: all] Error 2
==> ERROR: A failure occurred in build().
Aborting...
==> ERROR: Makepkg was unable to build vte3-notification.

dsboger commented on 2016-12-07 15:50

@mydongistiny No problems! I'm here to help (even if I didn't help at all and you could fix it by yourself :).

mydongistiny commented on 2016-12-07 06:56

@dsboger I didn't get a notification.

Sorry. I'm a moron and it's on my end. I just realized that after you said you couldn't reproduce. I force an older version of python for something and forgot I didn't remove it first. It's installed now.

dsboger commented on 2016-12-05 03:40

@mydongistiny I cannot reproduce the error on my end. It would be good if you could provide some more info:

1) are you using pure Arch or some derived distro (specially one with different repos)?
2) What is the version of gobject-introspection that you have installed?

Also, could you try building/installing the package without yaourt? That is to rule out issues with yaourt caching previous builds. In case you have never done that before, just running the following commands should do it:

$ git clone https://aur.archlinux.org/vte3-notification.git
$ cd vte3-notification
$ makepkg -si

Thanks!

dsboger commented on 2016-11-12 00:36

@Barthalion
Fixed. Thanks!

Barthalion commented on 2016-11-11 23:23

Checking vte3-notification-0.46.1-3-x86_64.pkg.tar.xz
vte3-notification E: Dependency gnutls detected and not included (libraries ['usr/lib/libgnutls.so.30'] needed in files ['usr/lib/libvte-2.91.so.0.4600.1'])

dsboger commented on 2016-11-08 23:59

Oops! forgot to add the new patch to the commit. Should be working now. Thanks for reporting!

defkev commented on 2016-11-08 21:47

+1

vte291-command-notify-scroll-speed.patch SHA256 not matching .SRCINFO

giuseppe commented on 2016-11-08 20:48

Seems like the checksum of "vte291-command-notify-scroll-speed.patch" needs to be corrected