Package Details: 8188eu-dkms v4.3.0.8_13968-8

Git Clone URL: https://aur.archlinux.org/8188eu-dkms.git (read-only)
Package Base: 8188eu-dkms
Description: Driver for Realtek RTL8188EUS (RTL8188EUS, RTL8188ETV) WLAN
Upstream URL: http://www.realtek.com.tw/
Keywords: 8188ETV 8188EUS
Licenses: GPL
Submitter: kpr
Maintainer: kpr
Last Packager: kpr
Votes: 16
Popularity: 0.006216
First Submitted: 2015-10-07 04:59
Last Updated: 2018-09-23 06:06

Latest Comments

1 2 3 Next › Last »

Pernat1y commented on 2018-10-03 08:26

Have issue on 4.18.11-1-ARCH (aarch64) (full log is here: http://pasted.co/a893e202 )

/var/lib/dkms/8188eu/v4.3.0.8_13968/build/core/rtw_br_ext.c:1447:28: error: implicit declaration of function 'csum_ipv6_magic'; did you mean 'csum_tcpudp_magic'? [-Werror=implicit-function-declaration] hdr->icmp6_cksum = csum_ipv6_magic(&iph->saddr, &iph->daddr, ^~~~~~~~~~~~~~~ csum_tcpudp_magic

oniony commented on 2018-09-19 19:41

I'm getting the following build errors when upgrading package linux 4.18.8. Any ideas?

Edit: seems this may be the same problem as @zhengyi5403 is having, as from what I can tell this data field was removed in Linux 4.15.0.

make: Entering directory '/usr/lib/modules/4.18.8-arch1-1-ARCH/build'
CC [M]  /var/lib/dkms/8188eu/v4.3.0.8_13968/build/core/rtw_cmd.o
In file included from 
/var/lib/dkms/8188eu/v4.3.0.8_13968/build/include/osdep_service.h:41,
                from 
/var/lib/dkms/8188eu/v4.3.0.8_13968/build/include/drv_types.h:32,
                from 
/var/lib/dkms/8188eu/v4.3.0.8_13968/build/core/rtw_cmd.c:22:
/var/lib/dkms/8188eu/v4.3.0.8_13968/build/include/osdep_service_linux.h: In function ‘_init_timer’:
/var/lib/dkms/8188eu/v4.3.0.8_13968/build/include/osdep_service_linux.h:261:8: error: ‘_timer’ {aka ‘struct timer_list’} has no member named ‘data’
ptimer->data = (unsigned long)cntx;
    ^~

/var/lib/dkms/8188eu/v4.3.0.8_13968/build/include/osdep_service_linux.h:262:2: error: implicit declaration of function ‘init_timer’; did you mean ‘_init_timer’? [-Werror=implicit-function-declaration]
init_timer(ptimer);
^~~~~~~~~~
_init_timer
In file included from 
/var/lib/dkms/8188eu/v4.3.0.8_13968/build/include/drv_types.h:32,
            from 
/var/lib/dkms/8188eu/v4.3.0.8_13968/build/core/rtw_cmd.c:22:
/var/lib/dkms/8188eu/v4.3.0.8_13968/build/include/osdep_service.h: In function ‘thread_enter’:
/var/lib/dkms/8188eu/v4.3.0.8_13968/build/include/osdep_service.h:342:2: error: implicit declaration of function ‘allow_signal’; did you mean ‘do_signal’? [-Werror=implicit-function-declaration]
allow_signal(SIGTERM);
^~~~~~~~~~~~
do_signal
/var/lib/dkms/8188eu/v4.3.0.8_13968/build/include/osdep_service.h: In function ‘flush_signals_thread’:
/var/lib/dkms/8188eu/v4.3.0.8_13968/build/include/osdep_service.h:352:6: error: implicit declaration of function ‘signal_pending’; did you mean ‘timer_pending’? [-Werror=implicit- function-declaration]
if (signal_pending (current))
    ^~~~~~~~~~~~~~
    timer_pending
/var/lib/dkms/8188eu/v4.3.0.8_13968/build/include/osdep_service.h:354:3: error: implicit declaration of function ‘flush_signals’; did you mean ‘do_signal’? [-Werror=implicit-function-declaration]
flush_signals(current);
^~~~~~~~~~~~~
do_signal
cc1: some warnings being treated as errors
make[1]: *** [scripts/Makefile.build:318: /var/lib/dkms/8188eu/v4.3.0.8_13968/build/core/rtw_cmd.o] Error 1
make: *** [Makefile:1504: _module_/var/lib/dkms/8188eu/v4.3.0.8_13968/build] Error 2
make: Leaving directory '/usr/lib/modules/4.18.8-arch1-1-ARCH/build'

dreieck commented on 2018-08-10 16:09

8188eu-v4.3.0.8_13968.tar.xz is an HTML file after download. dropbox download URL needs a ?dl=1 appended. Best to modify the first source-entry to:

"${_pkgname}-${pkgver}.tar.xz::<https://www.dropbox.com/s/afs5d2yfgwurqm2/>${_pkgname}-${pkgver}.tar.xz?dl=1"

zhengyi5403 commented on 2018-02-08 11:27

build fail with linux>=4.15

laloch commented on 2017-10-10 13:35

Does not work in HostAP mode with linux>=4.13 since commit 8bfb3676606454ffec836f56c5dc3e69dfc0956a removed legacy IOCTL interface from the wireless extensions module. The same applies to the mainline staging driver.

moham_96 commented on 2017-09-05 12:21

what are the advantages of this driver compared to driver included in mainline linux (r8188eu)?

rdnvndr commented on 2017-07-30 14:48

With my patch works. If you have problem, write about it.

Vale24 commented on 2017-07-26 18:04

I'm thinking about rolling back my kernal to get this thing to work. What was the lastest kernal version this driver was reported working?

I think the error is due to the kernal version, it wont build.


Building module:
cleaning build area...
CONFIG_RTL8188EU=m make -C /usr/lib/modules/4.11.9-1-ARCH/build M=/var/lib/dkms/8188eu/v4.3.0.8_13968/build modules...(bad exit status: 2)
Error! Bad return status for module build on kernel: 4.11.9-1-ARCH (x86_64)
Consult /var/lib/dkms/8188eu/v4.3.0.8_13968/build/make.log for more information.
error: command failed to execute correctly
:: Running post-transaction hooks...
(1/2) Install DKMS modules
==> dkms install 8188eu/v4.3.0.8_13968 -k 4.11.9-1-ARCH
Error! Bad return status for module build on kernel: 4.11.9-1-ARCH (x86_64)
Consult /var/lib/dkms/8188eu/v4.3.0.8_13968/build/make.log for more information.
(2/2) Arming ConditionNeedsUpdate...

vincenzo commented on 2017-06-25 08:23

Hi,

The same for me :

Building module:
cleaning build area...
CONFIG_RTL8188EU=m make -C /usr/lib/modules/4.11.6-3-ARCH/build M=/var/lib/dkms/8188eu/v4.3.0.8_13968/build modules...(bad exit status: 2)
Error! Bad return status for module build on kernel: 4.11.6-3-ARCH (x86_64)
Consult /var/lib/dkms/8188eu/v4.3.0.8_13968/build/make.log for more information.
erreur : la commande n’a pas pu être exécutée correctement
:: Exécution des crochets de post-transaction...
(1/2) Install DKMS modules
==> dkms install 8188eu/v4.3.0.8_13968 -k 4.11.6-3-ARCH
Error! Bad return status for module build on kernel: 4.11.6-3-ARCH (x86_64)
Consult /var/lib/dkms/8188eu/v4.3.0.8_13968/build/make.log for more information.
(2/2) Arming ConditionNeedsUpdate...
erreur : file owned by 'ath9k-htc-firmware' and 'linux-firmware': 'usr/lib/firmware/htc_7010.fw'
erreur : file owned by 'ath9k-htc-firmware' and 'linux-firmware': 'usr/lib/firmware/htc_9271.fw'


And then is the logs :

>cat /var/lib/dkms/8188eu/v4.3.0.8_13968/build/make.log
DKMS make.log for 8188eu-v4.3.0.8_13968 for kernel 4.11.6-3-ARCH (x86_64)
dim. juin 25 10:22:24 CEST 2017
make : on entre dans le répertoire « /usr/lib/modules/4.11.6-3-ARCH/build »
CC [M] /var/lib/dkms/8188eu/v4.3.0.8_13968/build/core/rtw_cmd.o
In file included from /var/lib/dkms/8188eu/v4.3.0.8_13968/build/include/drv_types.h:32:0,
from /var/lib/dkms/8188eu/v4.3.0.8_13968/build/core/rtw_cmd.c:22:
/var/lib/dkms/8188eu/v4.3.0.8_13968/build/include/osdep_service.h: Dans la fonction « thread_enter »:
/var/lib/dkms/8188eu/v4.3.0.8_13968/build/include/osdep_service.h:342:2: error: déclaration implicite de la fonction « allow_signal »; vouliez-vous utiliser « do_signal » ? [-Werror=implicit-function-declaration]
allow_signal(SIGTERM);
^~~~~~~~~~~~
do_signal
/var/lib/dkms/8188eu/v4.3.0.8_13968/build/include/osdep_service.h: Dans la fonction « flush_signals_thread »:
/var/lib/dkms/8188eu/v4.3.0.8_13968/build/include/osdep_service.h:352:6: error: déclaration implicite de la fonction « signal_pending »; vouliez-vous utiliser « timer_pending » ? [-Werror=implicit-function-declaration]
if (signal_pending (current))
^~~~~~~~~~~~~~
timer_pending
/var/lib/dkms/8188eu/v4.3.0.8_13968/build/include/osdep_service.h:354:3: error: déclaration implicite de la fonction « flush_signals »; vouliez-vous utiliser « do_signal » ? [-Werror=implicit-function-declaration]
flush_signals(current);
^~~~~~~~~~~~~
do_signal
cc1 : certains avertissements sont traités comme des erreurs
make[1]: *** [scripts/Makefile.build:295: /var/lib/dkms/8188eu/v4.3.0.8_13968/build/core/rtw_cmd.o] Error 1
make: *** [Makefile:1492: _module_/var/lib/dkms/8188eu/v4.3.0.8_13968/build] Error 2
make : on quitte le répertoire « /usr/lib/modules/4.11.6-3-ARCH/build »

0pper commented on 2017-06-01 20:14

This package broke for me with kernel 4.11.3.

Build log:
DKMS make.log for 8188eu-v4.3.0.8_13968 for kernel 4.11.3-1-ARCH (x86_64)
tor jun 1 21:44:55 CEST 2017
make: Entering directory '/usr/lib/modules/4.11.3-1-ARCH/build'
CC [M] /var/lib/dkms/8188eu/v4.3.0.8_13968/build/core/rtw_cmd.o
In file included from /var/lib/dkms/8188eu/v4.3.0.8_13968/build/include/drv_types.h:32:0,
from /var/lib/dkms/8188eu/v4.3.0.8_13968/build/core/rtw_cmd.c:22:
/var/lib/dkms/8188eu/v4.3.0.8_13968/build/include/osdep_service.h: I funktionen »thread_enter«:
/var/lib/dkms/8188eu/v4.3.0.8_13968/build/include/osdep_service.h:342:2: fejl: implicit declaration of function »allow_signal«; did you mean »do_signal«? [-Werror=implicit-function-declaration]
allow_signal(SIGTERM);
^~~~~~~~~~~~
do_signal
/var/lib/dkms/8188eu/v4.3.0.8_13968/build/include/osdep_service.h: I funktionen »flush_signals_thread«:
/var/lib/dkms/8188eu/v4.3.0.8_13968/build/include/osdep_service.h:352:6: fejl: implicit declaration of function »signal_pending«; did you mean »timer_pending«? [-Werror=implicit-function-declaration]
if (signal_pending (current))
^~~~~~~~~~~~~~
timer_pending
/var/lib/dkms/8188eu/v4.3.0.8_13968/build/include/osdep_service.h:354:3: fejl: implicit declaration of function »flush_signals«; did you mean »do_signal«? [-Werror=implicit-function-declaration]
flush_signals(current);
^~~~~~~~~~~~~
do_signal
cc1: nogle advarsler bliver opfattet som fejl
make[1]: *** [scripts/Makefile.build:295: /var/lib/dkms/8188eu/v4.3.0.8_13968/build/core/rtw_cmd.o] Error 1
make: *** [Makefile:1492: _module_/var/lib/dkms/8188eu/v4.3.0.8_13968/build] Error 2
make: Leaving directory '/usr/lib/modules/4.11.3-1-ARCH/build'