Package Details: adwaita-qt5 1.0-1

Git Clone URL: https://aur.archlinux.org/adwaita-qt.git (read-only)
Package Base: adwaita-qt
Description: A style to bend Qt applications to look like they belong into GNOME Shell (Qt5)
Upstream URL: https://github.com/MartinBriza/adwaita-qt
Keywords: gnome qt theme
Licenses: GPL
Groups: adwaita-qt
Conflicts: adwaita-qt-common
Replaces: adwaita-qt-common
Submitter: jurf
Maintainer: monotykamary
Last Packager: monotykamary
Votes: 69
Popularity: 0.775693
First Submitted: 2015-07-30 13:37
Last Updated: 2017-05-28 18:00

Dependencies (6)

Required by (3)

Sources (1)

Latest Comments

tya99 commented on 2018-07-22 02:32

Hmm, seems to work today. Not quite sure why I was getting that error.

tya99 commented on 2018-07-09 17:13

I am having trouble compiling this.

Scanning dependencies of target adwaita-qt4
make[2]: Leaving directory '/home/tya/adwaita-qt/src/adwaita-qt-1.0/build-qt4'
make -f style/CMakeFiles/adwaita-qt4.dir/build.make style/CMakeFiles/adwaita-qt4.dir/build
make[2]: Entering directory '/home/tya/adwaita-qt/src/adwaita-qt-1.0/build-qt4'
[  5%] Building CXX object style/CMakeFiles/adwaita-qt4.dir/animations/adwaitaanimation.cpp.o
cd /home/tya/adwaita-qt/src/adwaita-qt-1.0/build-qt4/style && /usr/sbin/c++  -DQT_PLUGIN -Dadwaita_qt4_EXPORTS -I/home/tya/adwaita-qt/src/adwaita-qt-1.0/build-qt4/style/adwaita-qt4_autogen/include -I/usr/include/qt4/QtDesigner -I/usr/include/qt4/QtDeclarative -I/usr/include/qt4/QtScriptTools -I/usr/include/qt4/QtDBus -I/usr/include/qt4/QtXml -I/usr/include/qt4/QtSql -I/usr/include/qt4/QtOpenGL -I/usr/include/qt4/QtMultimedia -I/usr/include/qt4/QtNetwork -I/usr/include/qt4/QtXmlPatterns -I/usr/include/qt4/QtHelp -I/usr/include/qt4/QtUiTools -I/usr/include/qt4/QtTest -I/usr/include/qt4/QtScript -I/usr/include/qt4/QtSvg -I/usr/include/qt4/Qt3Support -I/usr/include/qt4/QtGui -I/usr/include/qt4/QtCore -I/usr/share/qt4/mkspecs/default -I/usr/include/qt4 -I/home/tya/adwaita-qt/src/adwaita-qt-1.0/build-qt4/style -I/home/tya/adwaita-qt/src/adwaita-qt-1.0/style/. -I/home/tya/adwaita-qt/src/adwaita-qt-1.0/style/animations -I/home/tya/adwaita-qt/src/adwaita-qt-1.0/style/debug  -march=x86-64 -mtune=generic -O2 -pipe -fstack-protector-strong -fno-plt -O3 -DNDEBUG -fPIC   -std=c++11 -o CMakeFiles/adwaita-qt4.dir/animations/adwaitaanimation.cpp.o -c /home/tya/adwaita-qt/src/adwaita-qt-1.0/style/animations/adwaitaanimation.cpp
In file included from /usr/include/c++/8.1.1/bits/stl_algo.h:59,
                 from /usr/include/c++/8.1.1/algorithm:62,
                 from /usr/include/qt4/QtCore/qglobal.h:68,
                 from /usr/include/qt4/QtCore/QFlags:1,
                 from /home/tya/adwaita-qt/src/adwaita-qt-1.0/style/./adwaita.h:23,
                 from /home/tya/adwaita-qt/src/adwaita-qt-1.0/style/animations/adwaitaanimation.h:22,
                 from /home/tya/adwaita-qt/src/adwaita-qt-1.0/style/animations/adwaitaanimation.cpp:20:
/usr/include/c++/8.1.1/cstdlib:75:15: fatal error: stdlib.h: No such file or directory
 #include_next <stdlib.h>
               ^~~~~~~~~~
compilation terminated.
make[2]: *** [style/CMakeFiles/adwaita-qt4.dir/build.make:63: style/CMakeFiles/adwaita-qt4.dir/animations/adwaitaanimation.cpp.o] Error 1
make[2]: Leaving directory '/home/tya/adwaita-qt/src/adwaita-qt-1.0/build-qt4'
make[1]: *** [CMakeFiles/Makefile2:87: style/CMakeFiles/adwaita-qt4.dir/all] Error 2
make[1]: Leaving directory '/home/tya/adwaita-qt/src/adwaita-qt-1.0/build-qt4'
make: *** [Makefile:130: all] Error 2
make: Leaving directory '/home/tya/adwaita-qt/src/adwaita-qt-1.0/build-qt4'
==> ERROR: A failure occurred in build().
    Aborting...

My flags look okay...

~/adwaita-qt/src/adwaita-qt-1.0/build-qt5 ~/adwaita-qt/src/adwaita-qt-1.0
-- The C compiler identification is GNU 8.1.1
-- The CXX compiler identification is GNU 8.1.1
-- Check for working C compiler: /usr/sbin/cc
-- Check for working C compiler: /usr/sbin/cc -- works
-- Detecting C compiler ABI info
-- Detecting C compiler ABI info - done
-- Detecting C compile features
-- Detecting C compile features - done
-- Check for working CXX compiler: /usr/sbin/c++
-- Check for working CXX compiler: /usr/sbin/c++ -- works
-- Detecting CXX compiler ABI info
-- Detecting CXX compiler ABI info - done
-- Detecting CXX compile features
-- Detecting CXX compile features - done
-- Configuring done
-- Generating done
CMake Warning:
  Manually-specified variables were not used by the project:

    QT_ROOT
</stdlib.h>

monotykamary commented on 2017-11-19 00:06

@isacdaavid Which desktop environment / window manager are you using? Can you do a gdb backtrace and post the log?

isacdaavid commented on 2017-11-18 23:55

This doesn't seem to work. Applications crash when I try to use the `adwaita` theme.

Similarly, I was able to run qt5ct once to set the theme after installing, but segfaulted every subsequent time I tried to reopen it.

jurf commented on 2017-04-22 13:25

I’m not using Arch anymore, feel free to adopt this package, but take care of it!

jurf commented on 2015-09-26 19:30

There's a comment in the PKGBUILD explaining why I'm using master. There's an Arch specific script that hasn't landed in a release yet, and since I knew Martin was going away I though it was safe to to use master, and when you look at the commits, you see that only about 3 commits were made since this package was created, so it quite paid off. I'll change the checksums to SKIP, but this package is switching to regular releases once the fix lands, which will be the next release.

pavbaranov commented on 2015-09-26 05:10

I think you shoud change md5sums array in PKGBUILD to ('SKIP"). Sources are "master.zip" and its md5sums varies depending on when we download sources. Or maybe better is to change this package to "git" version...

jurf commented on 2015-08-15 20:36

Oh yeah. Duh. How could I have missed that. Thanks.

fturco commented on 2015-08-15 11:12

cmake should be added to the makedepends variable, otherwise you get the following error message: PKGBUILD: line 22: cmake: command not found