Package Details: asterisk-g729 1:1.4.3.r1.1710ea938ed0-1

Git Clone URL: https://aur.archlinux.org/asterisk-g729.git (read-only)
Package Base: asterisk-g729
Description: G.729 codec for Asterisk open source PBX
Upstream URL: http://asterisk.hosting.lv/
Licenses: IPP
Submitter: post-factum
Maintainer: post-factum
Last Packager: post-factum
Votes: 2
Popularity: 0.000013
First Submitted: 2017-04-05 17:37
Last Updated: 2019-04-06 19:31

Latest Comments

johny77 commented on 2017-10-09 10:46

Excellent job. Works!
If I could, I would like to give You A++++++ for support.
Thank You.

post-factum commented on 2017-10-08 11:24

OK, I've hand-crafted patch that makes this work with Asterisk 15.

post-factum commented on 2017-10-04 10:47

I do not see Asterisk 15 support in git tree yet.

johny77 commented on 2017-10-04 09:38

Hi, I am unable to build it with new asterisk 15


In file included from /usr/include/asterisk/channel.h:126:0,
from codec_g72x.c:33:
/usr/include/asterisk/alertpipe.h:70:9: error: declaration for parameter ‘ast_alertpipe_write’ but no such parameter
ssize_t ast_alertpipe_write(int alert_pipe[2]);
^~~~~~~~~~~~~~~~~~~
/usr/include/asterisk/alertpipe.h:47:6: error: declaration for parameter ‘ast_alertpipe_close’ but no such parameter
void ast_alertpipe_close(int alert_pipe[2]);
^~~~~~~~~~~~~~~~~~~
/usr/include/asterisk/alertpipe.h:39:5: error: declaration for parameter ‘ast_alertpipe_init’ but no such parameter
int ast_alertpipe_init(int alert_pipe[2]);
^~~~~~~~~~~~~~~~~~
/usr/include/asterisk/alertpipe.h:29:3: error: declaration for parameter ‘ast_alert_status_t’ but no such parameter
} ast_alert_status_t;
^~~~~~~~~~~~~~~~~~
In file included from codec_g72x.c:28:0:
codec_g72x.c:703:5: error: expected ‘{’ at end of input
AST_MODULE_INFO(ASTERISK_GPL_KEY, AST_MODFLAG_DEFAULT, G72X_DESC, .load = load_module, .unload = unload_module, .buildopt_sum = "");
^
make[1]: *** [Makefile:649: codec_g729_la-codec_g72x.lo] Error 1
make[1]: Leaving directory '/home/lucky/build/asterisk/asterisk-g729/src/arkadi-asterisk-g72x-ea18845ad977'
make: *** [Makefile:425: all] Error 2
==> ERROR: A failure occurred in build().
Aborting...