Package Details: core-lightning-git 23.08.r13576.990096f90-1

Git Clone URL: (read-only, click to copy)
Package Base: core-lightning-git
Description: A lightweight, highly customizable and standard compliant implementation of the Lightning Network protocol.
Upstream URL:
Keywords: bitcoin cryptocurrency lightningnetwork lightning_network lnd
Licenses: custom
Provides: python-pyln-client
Submitter: pizzaman
Maintainer: pizzaman
Last Packager: pizzaman
Votes: 2
Popularity: 0.000002
First Submitted: 2022-04-26 05:53 (UTC)
Last Updated: 2023-09-05 01:48 (UTC)

Latest Comments

pizzaman commented on 2022-04-26 05:56 (UTC)

@Spixmaster Thanks for the information.

Spixmaster commented on 2022-04-25 07:02 (UTC) (edited on 2022-04-25 07:02 (UTC) by Spixmaster)

They renamed the project to "core-lightning" (

pizzaman commented on 2021-06-02 17:21 (UTC)

Fixed. Let me know if there are any issues.

arpspoof commented on 2021-03-11 21:33 (UTC)

Anyone still here or care?

arpspoof commented on 2021-02-27 13:31 (UTC)

I'm getting a patch failure when compiling fresh:

Submodule 'external/libwally-core' ( registered for path 'external/libwally-core'
Cloning into '/home/me/.cache/pacaur/c-lightning-git/src/lightning/external/jsmn'...
Cloning into '/home/me/.cache/pacaur/c-lightning-git/src/lightning/external/libbacktrace'...
Cloning into '/home/me/.cache/pacaur/c-lightning-git/src/lightning/external/libsodium'...
Cloning into '/home/me/.cache/pacaur/c-lightning-git/src/lightning/external/libwally-core'...
Submodule path 'external/jsmn': checked out '18e9fe42cbfe21d65076f5c77ae2be379ad1270f'
Submodule path 'external/libbacktrace': checked out '5a99ff7fed66b8ea8f09c9805c138524a7035ece'
Submodule path 'external/libsodium': checked out '675149b9b8b66ff44152553fb3ebf9858128363d'
Submodule path 'external/libwally-core': checked out 'bf81e8b17069020dec0638e352298770aa382952'
patching file Makefile
Hunk #1 FAILED at 188.
1 out of 1 hunk FAILED -- saving rejects to file Makefile.rej
==> ERROR: A failure occurred in prepare().
:: failed to verify integrity or prepare c-lightning-git package

tensor5 commented on 2019-06-30 05:45 (UTC)

@pizzaman, thanks for reporting, try now.

pizzaman commented on 2019-06-23 05:37 (UTC)

==> Starting prepare()...
Submodule 'daemon/jsmn' ( registered for path 'external/jsmn'
Submodule 'external/libbacktrace' ( registered for path 'external/libbacktrace'
error: pathspec 'external/libbase58' did not match any file(s) known to git
==> ERROR: A failure occurred in prepare().
:: Unable to build c-lightning-git - makepkg exited with code: 4

tensor5 commented on 2018-02-06 12:12 (UTC)

@matiwinnetou, it should work now.

matiwinnetou commented on 2018-01-26 18:32 (UTC) (edited on 2018-01-26 18:32 (UTC) by matiwinnetou)

Wmissing-prototypes -Wold-style-definition -Wmissing-format-attribute -Wcast-qual  -DBINTOPKGLIBEXECDIR='"'../libexec/c-lightning'"' -Wall -Wundef -Wmissing-prototypes -Wmissing-declarations -Wstrict-prototypes -Wold-style-definition -std=gnu11 -g -fstack-protector -I ccan -I external/libsodium/src/libsodium/include -I external/libwally-core/include/ -I external/libwally-core/src/secp256k1/include/ -I external/jsmn/ -I external/libbase58/ -I external/libbacktrace -I . -I/usr/local/include   -DDEVELOPER=1 -DCCAN_TAL_DEBUG=1 -DCCAN_TAKE_DEBUG=1 -DSHACHAIN_BITS=48 -DJSMN_PARENT_LINKS -c -o atomic.lo ../libbacktrace/atomic.c
./libtool: line 496: CDPATH: command not found
libtool: Version mismatch error.  This is libtool 2.2.4, but the
libtool: definition of this LT_INIT comes from an older release.
libtool: You should recreate aclocal.m4 with macros from libtool 2.2.4
libtool: and run autoconf again.
make[2]: *** [Makefile:472: atomic.lo] Error 63
make[2]: Leaving directory '/tmp/yaourt-tmp-mati/aur-c-lightning-git/src/lightning/external/libbacktrace-build'
make[1]: *** [Makefile:354: all] Error 2
make[1]: Leaving directory '/tmp/yaourt-tmp-mati/aur-c-lightning-git/src/lightning/external/libbacktrace-build'
make: *** [external/Makefile:80: external/libbacktrace.a] Error 2
rm external/libwally-core/src/secp256k1/
==> ERROR: A failure occurred in build().

daurnimator commented on 2017-12-29 14:38 (UTC) (edited on 2017-12-29 14:38 (UTC) by daurnimator)

Compilation fails with:

external/libsodium.a(libsodium_la-randombytes.o):/home/daurnimator/.cache/aursync/c-lightning-git/src/lightning/external/libsodium/src/libsodium/randombytes/randombytes.c:28: undefined reference to `randombytes_sysrandom_implementation'
collect2: error: ld returned 1 exit status
make: *** [Makefile:258: lightningd/lightning_hsmd] Error 1
rm external/libwally-core/src/secp256k1/