Package Details: geany-plugins-git 1.33.0.r46.gfe6cb3d0-1

Git Clone URL: https://aur.archlinux.org/geany-plugins-git.git (read-only)
Package Base: geany-plugins-git
Description: Various plugins for Geany
Upstream URL: https://plugins.geany.org/
Licenses: GPL
Conflicts: geany-plugins, geany-plugins-svn
Provides: geany-plugins
Submitter: xyproto
Maintainer: None
Last Packager: trizen
Votes: 35
Popularity: 0.000180
First Submitted: 2011-12-17 12:35
Last Updated: 2018-04-06 14:19

Required by (1)

Sources (1)

Latest Comments

« First ‹ Previous 1 2 3 4 5 6 7 Next › Last »

hansi commented on 2014-09-23 17:19

Same problem here, won't build anymore...

checking consistency of all components of python development environment... no
configure: error: in `/tmp/yaourt-tmp-jean/aur-geany-plugins-git/src/geany-plugins':
configure: error:
Could not link test program to Python. Maybe the main Python library has been
installed in some non-standard library path. If so, pass it to configure,
via the LDFLAGS environment variable.
Example: ./configure LDFLAGS="-L/usr/non-standard-path/python/lib"
============================================================================
ERROR!
You probably have to install the development version of the Python package
for your distribution. The exact name of this package varies among them.
============================================================================

Nothing4You commented on 2014-09-06 18:49

this package is failing to build for quite some time already for me...
any ideas?

checking for Python include path... -I/usr/include/python3.4m
checking for Python library path... -L/usr/lib/python3.4/config -lpython3.4
checking for Python site-packages path... /usr/lib/python3.4/site-packages
checking python extra libraries... -lpthread -ldl -lutil
checking python extra linking flags... -Xlinker -export-dynamic
checking consistency of all components of python development environment... no
configure: error: in `/home/rschwab/build/geany-plugins-git/src/geany-plugins':
configure: error:
Could not link test program to Python. Maybe the main Python library has been
installed in some non-standard library path. If so, pass it to configure,
via the LDFLAGS environment variable.
Example: ./configure LDFLAGS="-L/usr/non-standard-path/python/lib"
============================================================================
ERROR!
You probably have to install the development version of the Python package
for your distribution. The exact name of this package varies among them.
============================================================================

See `config.log' for more details

in config.log i found the following:

configure:17434: checking consistency of all components of python development environment
configure:17460: gcc -o conftest -march=x86-64 -mtune=generic -O2 -pipe -fstack-protector-strong --param=ssp-buffer-size=4 -D_FORTIFY_SOURCE=2 -I/usr/include/python3.4m -Wl,-O1,--sort-common,--as-needed,-z,relro conftest.c -L/usr/lib/python3.4/config -lpython3.4 -Xlinker -export-dynamic -lpthread -ldl -lutil >&5
/usr/bin/ld: cannot find -lpython3.4
collect2: error: ld returned 1 exit status
configure:17460: $? = 1


However, python3.4 is installed on my system (system is up to date) and I also have installed geany-git

Name : python
Version : 3.4.1-1

xyproto commented on 2014-08-06 11:56

Sorry about the slow update of this package, the comments flew under my radar for a while. Updated the package to build in the same way as the geany-plugins package in [community]. Works now.

xyproto commented on 2014-01-23 14:39

GordinGR, IMO, geany-gtk3-git should rather add provides=('geany-git'), since geany and this package has not played well in the past.

GordonGR commented on 2014-01-17 14:45

Could you change depends=('geany-git') to depends=('geany'), please? Otherwise it doesn't acknoweledge geany-gtk3-git.

martinoff commented on 2014-01-07 15:53

yes it build ok with makepkg
change the ./waf with ./configure make and it work in clean chroot

xyproto commented on 2014-01-07 11:56

Ok. Does it work when building with makepkg? It builds fine here.

https://wiki.archlinux.org/index.php/Arch_User_Repository#Q:_What_is_the_difference_between_the_Arch_User_Repository_and_community.3F

martinoff commented on 2014-01-06 21:10

dose not build in clean chroot
==> Updated version: geany-plugins-git 1.23.0.196.g601b1cf-1
==> Starting build()...
Waf: The wscript in '/build/geany-plugins-git/src/geany-plugins' is unreadable
Traceback (most recent call last):
File "/build/geany-plugins-git/src/geany-plugins/.waf3-1.6.11-30618c54883417962c38f5d395f83584/waflib/Scripting.py", line 87, in waf_entry_point
set_main_module(Context.run_dir+os.sep+Context.WSCRIPT_FILE)
File "/build/geany-plugins-git/src/geany-plugins/.waf3-1.6.11-30618c54883417962c38f5d395f83584/waflib/Scripting.py", line 110, in set_main_module
Context.g_module=Context.load_module(file_path)
File "/build/geany-plugins-git/src/geany-plugins/.waf3-1.6.11-30618c54883417962c38f5d395f83584/waflib/extras/compat15.py", line 88, in load_module
ret=rev(path)
File "/build/geany-plugins-git/src/geany-plugins/.waf3-1.6.11-30618c54883417962c38f5d395f83584/waflib/Context.py", line 261, in load_module
code=Utils.readf(path,m='rU')
File "/build/geany-plugins-git/src/geany-plugins/.waf3-1.6.11-30618c54883417962c38f5d395f83584/waflib/Utils.py", line 85, in readf
txt=f.read()
File "/usr/lib/python3.3/encodings/ascii.py", line 26, in decode
return codecs.ascii_decode(input, self.errors)[0]
UnicodeDecodeError: 'ascii' codec can't decode byte 0xc3 in position 96: ordinal not in range(128)
==> ERROR: A failure occurred in build().
Aborting...

xyproto commented on 2013-10-19 20:11

Just tried building the package, it builds fine here. Have you read https://wiki.archlinux.org/index.php/AUR#Prerequisites ?

xyproto commented on 2013-10-19 20:07

@liquibyte I don't think you understand how AUR and git works. Report upstream problems upstream to the geany-plugins developers. Only flag a package if it is out of date (if ie. version 3.0 is flagged, but 3.1 has been released). Unflagging.