Package Details: gnome-vfs-nosmb 2.24.4-9

Git Clone URL: (read-only, click to copy)
Package Base: gnome-vfs-nosmb
Description: The GNOME Virtual File System
Upstream URL:
Licenses: LGPL
Conflicts: gnome-vfs
Provides: gnome-vfs
Submitter: hilton
Maintainer: bidulock
Last Packager: bidulock
Votes: 50
Popularity: 0.000000
First Submitted: 2010-11-10 21:28 (UTC)
Last Updated: 2015-06-10 11:47 (UTC)

Required by (12)

Sources (5)

Latest Comments

1 2 Next › Last »

soloturn commented on 2021-03-30 07:20 (UTC)

it looks like both should be replaced by GIO:

attila123 commented on 2019-11-20 13:12 (UTC) (edited on 2019-11-20 13:12 (UTC) by attila123)

During an update I am faced with the following question:

:: There are 2 providers available for gnome-vfs:
:: Repository AUR
1) gnome-vfs 2) gnome-vfs-nosmb

Enter a number (default=1):

Could you please enhance the Description of this package about how this package is different/better from the stock gnome-vfs package to help users to decide which one they should choose? Thanks.

bidulock commented on 2018-06-03 07:24 (UTC)

The dependency is fixed again.

dafta commented on 2018-06-01 14:55 (UTC)

The dependency gnome-mime-data is now broken. Can this package be updated?

wjhk23 commented on 2017-10-25 18:48 (UTC)

anyone having problems with libtool 'version missmatch' errors, check if you have anaconda installed and rename your install temporarily so it isn't using libtool from anaconda

bidulock commented on 2017-10-07 11:55 (UTC)

Builds fine for me in a clean chroot for both architectures with a locale of en_CA.UTF-8. Maybe try LANG="C" before makepkg.

Bloody_Wulf commented on 2017-09-29 10:17 (UTC)

The problematic file is doc/html/volumes.html There are three span-tags: <span class="refpurpose"> Directly behind are something that looks like a dash (in kate, mc shows some other characters), but it isn't a dash. Thats the troublemaker. Remove or replace that character and it should work.

kotnik commented on 2017-09-08 17:16 (UTC)

Failing to install after the build with: ``` /usr/bin/install -c -m 644 ./html/right.png /usr/bin/install -c -m 644 ./html/style.css /usr/bin/install -c -m 644 ./html/up.png /usr/bin/install -c -m 644 ./html/volumes.html Traceback (most recent call last): File "/usr/bin/gtkdoc-rebase", line 56, in <module> sys.exit( File "/usr/share/gtk-doc/python/gtkdoc/", line 73, in run ScanDirectory(dir, options) File "/usr/share/gtk-doc/python/gtkdoc/", line 131, in ScanDirectory ScanDirectory(subdir, options) File "/usr/share/gtk-doc/python/gtkdoc/", line 104, in ScanDirectory o = ReadDevhelp(scan_dir, entry) File "/usr/share/gtk-doc/python/gtkdoc/", line 137, in ReadDevhelp for line in open(os.path.join(dir, file)): File "/usr/lib/python3.6/encodings/", line 26, in decode return codecs.ascii_decode(input, self.errors)[0] UnicodeDecodeError: 'ascii' codec can't decode byte 0xc2 in position 3734: ordinal not in range(128) make[2]: *** [Makefile:889: install-data-local] Error 1 make[2]: Leaving directory '/tmp/yaourt-tmp-kotnik/aur-gnome-vfs-nosmb/src/gnome-vfs-2.24.4/doc' make[1]: *** [Makefile:633: install-am] Error 2 make[1]: Leaving directory '/tmp/yaourt-tmp-kotnik/aur-gnome-vfs-nosmb/src/gnome-vfs-2.24.4/doc' make: *** [Makefile:616: install-recursive] Error 1 ==> ERROR: A failure occurred in package(). Aborting... ==> ERROR: Makepkg was unable to build gnome-vfs-nosmb. ```

FadeMind commented on 2017-03-19 10:57 (UTC)

Unable build: ``` ../libtool: eval: line 1723: syntax error near unexpected token `$'B\E[m'' ../libtool: eval: line 1723: ` .libs/gnome-vfs-ace.o .libs/gnome-vfs-acl.o .libs/gnome-vfs-application-registry.o .libs/gnome-vfs-address.o .libs/gnome-vfs-async-job-map.o .libs/gnome-vfs-async-ops.o .libs/gnome-vfs-cancellable-ops.o .libs/gnome-vfs-cancellation.o .libs/gnome-vfs-configuration.o .libs/gnome-vfs-context.o .libs/gnome-vfs-directory.o .libs/gnome-vfs-drive.o .libs/gnome-vfs-file-info.o .libs/gnome-vfs-filesystem-type.o .libs/gnome-vfs-find-directory.o .libs/gnome-vfs-handle.o .libs/gnome-vfs-inet-connection.o .libs/gnome-vfs-init.o .libs/gnome-vfs-job-queue.o .libs/gnome-vfs-job.o .libs/gnome-vfs-method.o .libs/gnome-vfs-mime-handlers.o .libs/gnome-vfs-mime-info.o .libs/gnome-vfs-mime-info-cache.o .libs/gnome-vfs-mime-monitor.o .libs/gnome-vfs-mime-sniff-buffer.o .libs/gnome-vfs-mime.o .libs/gnome-vfs-mime-magic.o .libs/gnome-vfs-module-callback-module-api.o .libs/gnome-vfs-module-callback-private.o .libs/gnome-vfs-module-callback.o .libs/gnome-vfs-module-shared.o .libs/gnome-vfs-module.o .libs/gnome-vfs-monitor.o .libs/gnome-vfs-open-fd.o .libs/gnome-vfs-ops.o .libs/gnome-vfs-private-utils.o .libs/gnome-vfs-private.o .libs/gnome-vfs-resolve.o .libs/gnome-vfs-result.o .libs/gnome-vfs-socket-buffer.o .libs/gnome-vfs-socket.o .libs/gnome-vfs-ssl.o .libs/gnome-vfs-transform.o .libs/gnome-vfs-uri.o .libs/gnome-vfs-utils.o .libs/gnome-vfs-volume-monitor.o .libs/gnome-vfs-volume.o .libs/gnome-vfs-xfer.o .libs/xdgmimemagic.o .libs/xdgmime.o .libs/xdgmimecache.o .libs/xdgmimeglob.o .libs/xdgmimeint.o .libs/xdgmimealias.o .libs/xdgmimeparent.o .libs/xdgmimeicon.o .libs/gnome-vfs-enum-types.o .libs/gnome-vfs-cdrom.o .libs/gnome-vfs-daemon-method.o .libs/gnome-vfs-dbus-utils.o .libs/gnome-vfs-dns-sd.o .libs/gnome-vfs-module-callback-marshall.o .libs/gnome-vfs-parse-ls.o .libs/gnome-vfs-pty.o .libs/gnome-vfs-volume-monitor-client.o .libs/gnome-vfs-volume-ops.o | | /usr/bin/sed 's/.* //' | sort | uniq > .libs/libgnomevfs-2.exp' make[3]: *** [Makefile:929:] Error 2 make[3]: Leaving directory '/tmp/yaourt-tmp-fademind/aur-gnome-vfs-nosmb/src/gnome-vfs-2.24.4/libgnomevfs' make[2]: *** [Makefile:844: all] Error 2 make[2]: Leaving directory '/tmp/yaourt-tmp-fademind/aur-gnome-vfs-nosmb/src/gnome-vfs-2.24.4/libgnomevfs' make[1]: *** [Makefile:615: all-recursive] Error 1 make[1]: Leaving directory '/tmp/yaourt-tmp-fademind/aur-gnome-vfs-nosmb/src/gnome-vfs-2.24.4' make: *** [Makefile:518: all] Error 2 ==> ERROR: A failure occurred in build(). Aborting... ==> ERROR: Makepkg was unable to build gnome-vfs-nosmb. ==> Restart building gnome-vfs-nosmb ? [y/N] ==> ---------------------------------------- ```

JohnRobson commented on 2017-02-11 17:03 (UTC)

automake: warning: autoconf input should be named '', not '' daemon/ warning: '%'-style pattern rules are a GNU make extension daemon/ warning: 'INCLUDES' is the old name for 'AM_CPPFLAGS' (or '*_CPPFLAGS') daemon/ installing './depcomp' automake: error: cannot open < gtk-doc.make: No such file or directory ==> ERROR: A failure occurred in build(). Aborting... ==> ERROR: Makepkg was unable to build gnome-vfs-nosmb.