Package Details: guake-git 3.2.1.11.g284f9e9-2

Git Clone URL: https://aur.archlinux.org/guake-git.git (read-only)
Package Base: guake-git
Description: Top-down terminal for Gnome using gtk3 and vte3
Upstream URL: https://github.com/Guake/guake
Licenses: GPL
Conflicts: guake, guake-gtk2-git
Provides: guake
Submitter: Skatox
Maintainer: Skatox
Last Packager: Skatox
Votes: 46
Popularity: 0.548822
First Submitted: 2008-03-07 02:12
Last Updated: 2018-05-02 01:57

Latest Comments

1 2 3 4 5 6 ... Next › Last »

ninjalf2 commented on 2018-08-04 22:58

I am getting the following error:

Traceback (most recent call last): File "/usr/local/bin/guake", line 6, in <module> from guake.main import exec_main ModuleNotFoundError: No module named 'guake'

Skatox commented on 2018-05-02 01:57

@thrakcattak updated. :)

thrakcattak commented on 2018-05-01 21:01

you should change

- make install DESTDIR="$pkgdir/" PREFIX="$pkgdir/usr/" COMPILE_SCHEMA=0

to

+ make install DESTDIR="$pkgdir/" prefix="/usr" COMPILE_SCHEMA=0

Skatox commented on 2018-05-01 03:17

Updated PKGBUILD with aichingm's help. His credits were updated.

BTW, I've maintaining this PKGBUILD for 10 years!! :D

Skatox commented on 2018-05-01 03:16

Updated PKGBUILD with aichingm's help. His credits were updated.

BTW, I've maintaining this PKGBUILD for 10 years!! :D

aichingm commented on 2018-04-30 19:06

@Skatox We changed some parts of the Makefile to simplify the build process for non debian/ubuntu systems, now one need only to run "make build && make install ...".

I updated my PKGBUILD: https://gist.github.com/aichingm/ed35ba3b136be4424b1ac947207dbca3 which builds just fine.

Skatox commented on 2018-04-27 01:23

I'm having problems to compile this version, according to the author, some manual intervetion will be fixed on version 3.1. I'm waiting for that to update the package.

dano5 commented on 2018-04-26 14:10

anyone else manage to install successfully?

dano5 commented on 2018-04-13 11:29

tried to install it today:

install -Dm644 "guake/data/guake.desktop" "//usr/local/share/applications/guake.desktop"
install: cannot create regular file '//usr/local/share/applications/guake.desktop': Permission denied
make: *** [Makefile:106: install-schemas] Error 1
==> ERROR: A failure occurred in package().
    Aborting...
:: Unable to build guake-git - makepkg exited with code: 2

bmbaker commented on 2018-02-14 13:22

its failing to build for me too

Ignoring typing: markers 'python_version < "3.5"' don't match your environment Collecting pbr (from -r requirements.txt (line 13)) Using cached pbr-3.1.1-py2.py3-none-any.whl Installing collected packages: pbr Exception: Traceback (most recent call last): File "/usr/lib/python3.6/site-packages/pip/basecommand.py", line 215, in main status = self.run(options, args) File "/usr/lib/python3.6/site-packages/pip/commands/install.py", line 342, in run prefix=options.prefix_path, File "/usr/lib/python3.6/site-packages/pip/req/req_set.py", line 784, in install **kwargs File "/usr/lib/python3.6/site-packages/pip/req/req_install.py", line 851, in install self.move_wheel_files(self.source_dir, root=root, prefix=prefix) File "/usr/lib/python3.6/site-packages/pip/req/req_install.py", line 1064, in move_wheel_files isolated=self.isolated, File "/usr/lib/python3.6/site-packages/pip/wheel.py", line 345, in move_wheel_files clobber(source, lib_dir, True) File "/usr/lib/python3.6/site-packages/pip/wheel.py", line 316, in clobber ensure_dir(destdir) File "/usr/lib/python3.6/site-packages/pip/utils/init.py", line 83, in ensure_dir os.makedirs(path) File "/usr/lib/python3.6/os.py", line 220, in makedirs mkdir(name, mode) PermissionError: [Errno 13] Permission denied: '/usr/lib/python3.6/site-packages/pbr-3.1.1.dist-info'