Package Details: ignition-fuel_tools 1.0.0-1

Git Clone URL: https://aur.archlinux.org/ignition-fuel_tools.git (read-only)
Package Base: ignition-fuel_tools
Description: A C++ client library and command line tools for interacting with Ignition Fuel servers
Upstream URL: http://ignitionrobotics.org/libs/fuel_tools
Licenses: Apache
Groups: development
Submitter: racko
Maintainer: racko
Last Packager: racko
Votes: 0
Popularity: 0.000000
First Submitted: 2018-02-24 10:24
Last Updated: 2018-02-24 10:24

Latest Comments

corvus_192 commented on 2018-05-23 10:17

I get errors trying to build this:

-- ignition-fuel_tools1 version 1.0.0
-- Operating system is Linux
-- Looking for IgnCURL - found

-- Checking for module 'jsoncpp'
--   Found jsoncpp, version 0.0.0
-- Looking for JSONCPP - found

-- Checking for module 'yaml-0.1'
--   Found yaml-0.1, version 0.1.7
-- Looking for YAML - found

-- Checking for module 'libzip'
--   Found libzip, version 1.5.1
-- Looking for ZIP - found

-- Checking for module 'tinyxml2'
--   Found tinyxml2, version 6.2.0
-- Looking for dlfcn.h - found
-- Looking for libdl - found
-- FreeImage.pc not found, we will search for FreeImage_INCLUDE_DIRS and FreeImage_LIBRARIES
-- Checking for module 'uuid'
--   Found uuid, version 2.32.0
-- Checking for module 'gts'
--   Found gts, version 0.7.6
-- Checking for module 'libswscale'
--   Found libswscale, version 5.1.100
-- Checking for module 'libavdevice >= 56.4.100'
--   Found libavdevice , version 58.3.100
-- Checking for module 'libavformat'
--   Found libavformat, version 58.12.100
-- Checking for module 'libavcodec'
--   Found libavcodec, version 58.18.100
-- Checking for module 'libavutil'
--   Found libavutil, version 56.14.100
-- Looking for ignition-common1 - found

-- 
-- Searching for host SSE information
-- SSE2 found
-- SSE3 found
-- SSE4.1 found
-- SSE4.2 found
-- Testing is disabled -- skipping UNIT tests
-- Testing is disabled -- skipping INTEGRATION tests
-- Testing is disabled -- skipping PERFORMANCE tests
-- Testing is disabled -- skipping REGRESSION tests
-- Build configuration successful
-- Looking for ronn to generate manpages - found
-- Build type: Release
-- Install prefix: /usr
-- Configuring done
-- Generating done
-- Build files have been written to: /home/jendrik/.cache/aursync/ignition-fuel_tools/src/ignitionrobotics-ign-fuel-tools-ac2fa2004080/build
[  5%] Generating API documentation with Doxygen
[ 11%] Building CXX object src/CMakeFiles/ignition-fuel_tools1.dir/JSONParser.cc.o
[ 23%] Built target gtest
[ 35%] Built target gtest_main
[ 35%] Built target doc
/home/jendrik/.cache/aursync/ignition-fuel_tools/src/ignitionrobotics-ign-fuel-tools-ac2fa2004080/src/JSONParser.cc: In static member function ‘static ignition::fuel_tools::ModelIdentifier ignition::fuel_tools::JSONParser::ParseModel(const string&, const ignition::fuel_tools::ServerConfig&)’:
/home/jendrik/.cache/aursync/ignition-fuel_tools/src/ignitionrobotics-ign-fuel-tools-ac2fa2004080/src/JSONParser.cc:96:3: error: ‘JSONCPP_STRING’ was not declared in this scope
   JSONCPP_STRING errs;
   ^~~~~~~~~~~~~~
/home/jendrik/.cache/aursync/ignition-fuel_tools/src/ignitionrobotics-ign-fuel-tools-ac2fa2004080/src/JSONParser.cc:98:47: error: ‘errs’ was not declared in this scope
   Json::parseFromStream(reader, iss, &model, &errs);
                                               ^~~~
/home/jendrik/.cache/aursync/ignition-fuel_tools/src/ignitionrobotics-ign-fuel-tools-ac2fa2004080/src/JSONParser.cc:98:47: note: suggested alternative: ‘errno’
   Json::parseFromStream(reader, iss, &model, &errs);
                                               ^~~~
                                               errno
/home/jendrik/.cache/aursync/ignition-fuel_tools/src/ignitionrobotics-ign-fuel-tools-ac2fa2004080/src/JSONParser.cc: In static member function ‘static std::vector<ignition::fuel_tools::ModelIdentifier> ignition::fuel_tools::JSONParser::ParseModels(const string&, const ignition::fuel_tools::ServerConfig&)’:
/home/jendrik/.cache/aursync/ignition-fuel_tools/src/ignitionrobotics-ign-fuel-tools-ac2fa2004080/src/JSONParser.cc:115:3: error: ‘JSONCPP_STRING’ was not declared in this scope
   JSONCPP_STRING errs;
   ^~~~~~~~~~~~~~
/home/jendrik/.cache/aursync/ignition-fuel_tools/src/ignitionrobotics-ign-fuel-tools-ac2fa2004080/src/JSONParser.cc:117:48: error: ‘errs’ was not declared in this scope
   Json::parseFromStream(reader, iss, &models, &errs);
                                                ^~~~
/home/jendrik/.cache/aursync/ignition-fuel_tools/src/ignitionrobotics-ign-fuel-tools-ac2fa2004080/src/JSONParser.cc:117:48: note: suggested alternative: ‘errno’
   Json::parseFromStream(reader, iss, &models, &errs);
                                                ^~~~
                                                errno
make[2]: *** [src/CMakeFiles/ignition-fuel_tools1.dir/build.make:102: src/CMakeFiles/ignition-fuel_tools1.dir/JSONParser.cc.o] Error 1
make[1]: *** [CMakeFiles/Makefile2:152: src/CMakeFiles/ignition-fuel_tools1.dir/all] Error 2
make: *** [Makefile:141: all] Error 2
==> ERROR: A failure occurred in build().
    Aborting...